{"text_format":"1","workbook":"xlsx","n_sheets":16,"sheets":["Overview","Flight Items","Consortium","MPP","ADV","Contact","FlightItem","Deliverables","BIPRs","TableConsortium","TableBIPRs","TableMilestones","TableBreakdown","TableAdvance","TableDeliverables","references"],"not_rendered":{"charts":0,"images":2,"macros":1,"external_links":0,"defined_names":7,"comments":0,"pivot_tables":0},"unopened":[],"bounds":{"document_bytes":16777216,"sheet_cells":100000,"rows_first":2000,"rows_last":500,"rows_between":2000,"halvings":0,"cell_chars":16384,"cell_head_chars":4096},"cells_cut":0,"cells_raw":0,"read":"whole","date_system":"1900"}

{"sheet":"Overview","index":0,"n_rows":39,"n_cols":7,"rows_kept":39,"cut":false,"hidden":false,"merged":[]}
["GENERAL",null,"FILL IN THE CELLS WITH THE LIGHT BLUE BACKGROUND"]
["Activity Name","Our Awesome Project",null,null,null,null,"The buttons below are to be used by the bidder "]
["Activity Main Domain","Space Segment","Select the main segment of your activity"]
["Total Price in Euro",{"$f":"IF(B9=2,SUM(Consortium!F3:F14)+SUM(Consortium!N3:N15),SUM(Consortium!F3:F14))","v":1315000},"Sum of Consortium Price - fill Consortium sheet"]
["Total Cost in Euro",{"$f":"IF(B9=2,SUM(Consortium!E3:E15)+SUM(Consortium!M3:M15),SUM(Consortium!E3:E15))","v":2430000},"Sum of Consortium Cost - fill Consortium sheet"]
["Prime Name",{"$f":"Consortium!B3","v":"Our company"},"From Consortium sheet"]
["Prime Country",{"$f":"Consortium!C3","v":"IT"},"From Consortium sheet"]
["InCubed Development Cycle","De-risking + Product Development","Select the chosen InCubed Development Cycle"]
["Number of Phases",2,"If contract is not phased enter 1. Maximum 2 phases with this tool."]
["Number of Subcos in Phase 1",1,"Maximum 11 subcos with this tool"]
["Number of Subcos in Phase 2",2,"Maximum 11 subcos with this tool"]
[{"$f":"IF(B9=1,\"Number of Milestones\",\"Number of Milestones in Phase 1\")","v":"Number of Milestones in Phase 1"},2,"Maximum 8 milestones with this tool, suggested maximum two milestones per year."]
[{"$f":"IF(B9=2,\"Number of Milestones in Phase 2\",\"\")","v":"Number of Milestones in Phase 2"},5,"Maximum 8 milestones with this tool, suggested maximum two milestones per year."]
[{"$f":"IF(B9=1,\"Advance Foreseen\", \"Advance Foreseen in Phase 1\")","v":"Advance Foreseen in Phase 1"},{"$f":"IF(COUNTIF(Consortium!G3:G14,\"Yes\")>0,\"Yes\",\"No\")","v":"Yes"},"From Consortium sheet"]
[{"$f":"IF(B9=2, \"Advance Foreseen in Phase 2\",\"\")","v":"Advance Foreseen in Phase 2"},{"$f":"IF(COUNTIF(Consortium!O3:O14,\"Yes\")>0,\"Yes\",\"No\")","v":"Yes"},"From Consortium sheet"]
["Expected Contract Signature","2023-08-17","Use format dd/mm/yyyy. It should be later than today"]
["Final Delivery Date",{"$f":"B18-4*7","v":"2024-12-18"},"4 weeks before final milestone - fill MPP sheet"]
["End of Contract",{"$f":"IF(B9=1,MAX(MPP!C5:C12),MAX(MPP!C17:C24))","v":"2025-01-15"},"Latest milestone in the MPP - fill MPP sheet"]
[]
["Agree to use digital signatures only","yes","Select YES if you are OK to use only e-signing digital tools, or NO if you foresee to use also handwritten scanned signatures"]
[]
["PHASE(S)",null,"Date of achievement must consistent with last milestone of Phase 1"]
["Intermediate Phase","date of achievement","Draft report to be submitted 4 weeks before","deadline report",-4,"in weeks"]
[1,{"$f":"MAX(MPP!C5:C12)","v":"2023-09-30"},"In case of phased contract, this is last milestone of Phase 1",{"$f":" IF(B9>1,\"The draft Phase 1 Report, shall be submitted by email in electronic searchable, indexed and not encrypted PDF and original (WORD)\" & \"format for approval, to the Agency’s Technical Officer specified in Article 5, Clause 5, Sub-Clause 5.1 a) of the Contract, not later than \" & TEXT(B24 - 7*references!$C$47, \"dd mmmm yyyy\"),\"\")","v":"The draft Phase 1 Report, shall be submitted by email in electronic searchable, indexed and not encrypted PDF and original (WORD)format for approval, to the Agency’s Technical Officer specified in Article 5, Clause 5, Sub-Clause 5.1 a) of the Contract, not later than 02 September 2023"}]
[2,null,null,{"$f":" IF(B9>2,\"The draft Phase 2 Report, shall be submitted by email in electronic searchable, indexed and not encrypted PDF and original (WORD)\" & \"format for approval, to the Agency’s Technical Officer specified in Article 5, Clause 5, Sub-Clause 5.1 a) of the Contract, not later than \" & TEXT(B25 - 7*references!$C$47, \"dd mmmm yyyy\"),\"\")","v":""},null,null,"The buttons below are only to be used by ESA "]
[null,null,null,null,null,null,"They require a password"]
["Is Software Development Foreseen?","no"]
["Is Hardware Development Foreseen?","no"]
["Do you request the waiver for HW ownership?","no"]
["BACKGROUND INTELLECTUAL PROPERTY RIGHTS"]
["how many BIPR items do you have?",1,"Maximum 4 items. Please fill in BIPRs tab of the file."]
[]
["ADDITIONAL INFO"]
["Source of co-funding:","Internal Funds"]
["If other, please specify:"]
[]
["Is your company based in EU?","yes"]
[]
["Type of ESA Price","Firm Fixed Price"]

{"sheet":"Flight Items","index":1,"n_rows":11,"n_cols":5,"rows_kept":11,"cut":false,"hidden":true,"merged":[]}
["Are there any flight items foreseen ?",null,{"$f":" \"as defined in \" &#REF!","v":{"$error":"#REF!"}}]
[null,"no"]
[]
["How many ?",2,"maximum 4 in this tool"]
[]
[]
["Item name","delivery date","alternative delivery + X months",null,"name of item is name of flight item/payload/spacecraft"]
[null,null,null,1,"delivery date is the date at which the item shall be delivered to the launch authority "]
[null,null,null,2,"alternative deadline : date of the deadline for proposing an alternative launch in case the first choice is not available"]
[null,null,null,3]
[null,null,null,4]

{"sheet":"Consortium","index":2,"n_rows":15,"n_cols":15,"rows_kept":15,"cut":false,"hidden":false,"merged":[]}
["# of Subcos","Phase 1",null,null,null,null,null,null,"# of Subcos","Phase 2"]
[{"$f":"Overview!B10","v":1},"Entity","Country\n(ISO Code)","Role","Cost in Euro","Price in Euro","Advance Requested",null,{"$f":"Overview!B11","v":2},"Entity","Country\n(ISO Code)","Role","Cost in Euro","Price in Euro","Advance Requested"]
[null,"Our company","IT","Prime",1000000,500000,"Yes",null,null,"Our company","IT","Prime",1000000,600000,"Yes"]
[1,"Subco 1","AT","Subco",50000,25000,"Yes",null,1,"Subco 1","AT","Subco",200000,100000,"No"]
[2,null,null,null,null,null,"No",null,2,"Subco 2","DE","Subco",180000,90000,"No"]
[3,null,null,null,null,null,"No",null,3,null,null,null,null,null,"No"]
[4,null,null,null,null,null,"No",null,4,null,null,null,null,null,"No"]
[5,null,null,null,null,null,"No",null,5,null,null,null,null,null,"No"]
[6,null,null,null,null,null,"No",null,6,null,null,null,null,null,"No"]
[7,null,null,null,null,null,"No",null,7,null,null,null,null,null,"No"]
[8,null,null,null,null,null,"No",null,8,null,null,null,null,null,"No"]
[9,null,null,null,null,null,"No",null,9,null,null,null,null,null,"No"]
[10,null,null,null,null,null,"No",null,10,null,null,null,null,null,"No"]
[11,null,null,null,null,null,"No",null,11,null,null,null,null,null,"No"]
[12,null,null,null,null,null,null,null,12]

{"sheet":"MPP","index":3,"n_rows":51,"n_cols":19,"rows_kept":51,"cut":false,"hidden":false,"merged":[]}
[null,null,"Total Phase 1 =",{"$f":"SUM(Consortium!F3:F14)","v":525000},null,null,null,null,null,null,null,null,null,null,null,null,null,"Total Phase 2 =",{"$f":"SUM(Consortium!N3:N14)","v":790000}]
[null,"Phase 1 - Milestone Payment Plan",null,null,null,"Scroll down to fill Prime/Subcos Payments Breakdown tables!"]
["# of Milestones"]
[{"$f":"Overview!B12","v":2},"Milestone Description","Schedule Date","Amount in EUR","Country \n(ISO Code)"]
[1,"Milestone Description","2023-07-16",225000,"IT",null,{"$f":"LOOKUP(2,1/(B5:B12<>\"\"),B5:B12)","v":"Milestone Description"}]
[2,"Milestone Description","2023-09-30",300000,"IT"]
[3]
[4]
[5]
[6]
[7]
[8]
[9,null,null,{"$f":"IF(A13>$A$4,0,$D$1/$A$4)","v":0}]
[null,"Phase 2 - Milestone Payment Plan"]
["# of Milestones"]
[{"$f":"Overview!B13","v":5},"Milestone Description","Schedule Date","Amount in EUR","Country \n(ISO Code)"]
[1,"Milestone Description","2023-10-30",200000,"IT"]
[2,"Milestone Description","2024-01-30",200000,"IT"]
[3,"Milestone Description","2024-06-15",150000,"IT"]
[4,"Milestone Description","2024-10-15",200000,"IT"]
[5,"Milestone Description","2025-01-15",40000,"IT"]
[6]
[7]
[8]
[9,null,null,{"$f":"IF(A25>$A$16,0,$S$1/$A$16)","v":0}]
[]
[null,"Phase 1 - Breakdown of Payments"]
[null,null,{"$f":"Overview!B10","v":1},1,2,3,4,5,6,7,8,9,10,11]
[null,"Milestone",{"$f":"Consortium!B3&CHAR(10)& \"(\"&Consortium!C3&\")\"","v":"Our company\n(IT)"},{"$f":"Consortium!B4&CHAR(10)& \"(\"&Consortium!C4&\")\"","v":"Subco 1\n(AT)"},{"$f":"Consortium!B5&CHAR(10)& \"(\"&Consortium!C5&\")\"","v":"\n()"},{"$f":"Consortium!B6&CHAR(10)& \"(\"&Consortium!C6&\")\"","v":"\n()"},{"$f":"Consortium!B7&CHAR(10)& \"(\"&Consortium!C7&\")\"","v":"\n()"},{"$f":"Consortium!B8&CHAR(10)& \"(\"&Consortium!C8&\")\"","v":"\n()"},{"$f":"Consortium!B9&CHAR(10)& \"(\"&Consortium!C9&\")\"","v":"\n()"},{"$f":"Consortium!B10&CHAR(10)& \"(\"&Consortium!C10&\")\"","v":"\n()"},{"$f":"Consortium!B11&CHAR(10)& \"(\"&Consortium!C11&\")\"","v":"\n()"},{"$f":"Consortium!B12&CHAR(10)& \"(\"&Consortium!C12&\")\"","v":"\n()"},{"$f":"Consortium!B13&CHAR(10)& \"(\"&Consortium!C13&\")\"","v":"\n()"},{"$f":"Consortium!B14&CHAR(10)& \"(\"&Consortium!C14&\")\"","v":"\n()"}]
[1,"Milestone Description",210000,15000]
[2,"Milestone Description",290000,10000]
[3]
[4]
[5]
[6]
[7]
[8]
[9]
[]
[null,"Phase 2 - Breakdown of Payments"]
[null,null,{"$f":"Overview!B11","v":2},{"$f":"D28","v":1},2,3,4,5,6,7,8,9,10,11]
[null,{"$f":"B29","v":"Milestone"},{"$f":"Consortium!J3&CHAR(10)&\"(\"&Consortium!K3&\")\"","v":"Our company\n(IT)"},{"$f":"Consortium!J4&CHAR(10)&\"(\"&Consortium!K4&\")\"","v":"Subco 1\n(AT)"},{"$f":"Consortium!J5&CHAR(10)&\"(\"&Consortium!K5&\")\"","v":"Subco 2\n(DE)"},{"$f":"Consortium!J6&CHAR(10)&\"(\"&Consortium!K6&\")\"","v":"\n()"},{"$f":"Consortium!J7&CHAR(10)&\"(\"&Consortium!K7&\")\"","v":"\n()"},{"$f":"Consortium!J8&CHAR(10)&\"(\"&Consortium!K8&\")\"","v":"\n()"},{"$f":"Consortium!J9&CHAR(10)&\"(\"&Consortium!K9&\")\"","v":"\n()"},{"$f":"Consortium!J10&CHAR(10)&\"(\"&Consortium!K10&\")\"","v":"\n()"},{"$f":"Consortium!J11&CHAR(10)&\"(\"&Consortium!K11&\")\"","v":"\n()"},{"$f":"Consortium!J12&CHAR(10)&\"(\"&Consortium!K12&\")\"","v":"\n()"},{"$f":"Consortium!J13&CHAR(10)&\"(\"&Consortium!K13&\")\"","v":"\n()"},{"$f":"Consortium!J14&CHAR(10)&\"(\"&Consortium!K14&\")\"","v":"\n()"}]
[1,"Milestone Description",140000,40000,20000]
[2,"Milestone Description",160000,20000,20000]
[3,"Milestone Description",110000,20000,20000]
[4,"Milestone Description",170000,10000,20000]
[5,"Milestone Description",20000,10000,10000]
[6]
[7]
[8]
[9]

{"sheet":"ADV","index":4,"n_rows":199,"n_cols":11,"rows_kept":199,"cut":false,"hidden":false,"merged":[[2,3,9,3],[2,4,9,4],[2,5,9,5],[2,6,9,6],[2,7,9,7],[2,10,9,10],[26,3,33,3],[26,4,33,4],[26,5,33,5],[26,6,33,6],[26,7,33,7],[26,10,33,10],[10,7,17,7],[10,10,17,10],[18,3,25,3],[18,4,25,4],[18,5,25,5],[18,6,25,6],[18,7,25,7],[18,10,25,10],[10,3,17,3],[10,4,17,4],[10,5,17,5],[10,6,17,6],[42,3,49,3],[42,4,49,4],[42,5,49,5],[42,6,49,6],[42,7,49,7],[42,10,49,10],[34,3,41,3],[34,4,41,4],[34,5,41,5],[34,6,41,6],[34,7,41,7],[34,10,41,10],[58,3,65,3],[58,4,65,4],[58,5,65,5],[58,6,65,6],[58,7,65,7],[58,10,65,10],[50,3,57,3],[50,4,57,4],[50,5,57,5],[50,6,57,6],[50,7,57,7],[50,10,57,10],[74,3,81,3],[74,4,81,4],[74,5,81,5],[74,6,81,6],[74,7,81,7],[74,10,81,10],[66,3,73,3],[66,4,73,4],[66,5,73,5],[66,6,73,6],[66,7,73,7],[66,10,73,10],[90,3,97,3],[90,4,97,4],[90,5,97,5],[90,6,97,6],[90,7,97,7],[90,10,97,10],[82,3,89,3],[82,4,89,4],[82,5,89,5],[82,6,89,6],[82,7,89,7],[82,10,89,10],[111,3,118,3],[111,4,118,4],[111,5,118,5],[111,6,118,6],[111,7,118,7],[111,10,118,10],[103,3,110,3],[103,4,110,4],[103,5,110,5],[103,6,110,6],[103,7,110,7],[103,10,110,10],[127,3,134,3],[127,4,134,4],[127,5,134,5],[127,6,134,6],[127,7,134,7],[127,10,134,10],[119,3,126,3],[119,4,126,4],[119,5,126,5],[119,6,126,6],[119,7,126,7],[119,10,126,10],[143,3,150,3],[143,4,150,4],[143,5,150,5],[143,6,150,6],[143,7,150,7],[143,10,150,10],[135,3,142,3],[135,4,142,4],[135,5,142,5],[135,6,142,6],[135,7,142,7],[135,10,142,10],[159,3,166,3],[159,4,166,4],[159,5,166,5],[159,6,166,6],[159,7,166,7],[159,10,166,10],[151,3,158,3],[151,4,158,4],[151,5,158,5],[151,6,158,6],[151,7,158,7],[151,10,158,10],[175,3,182,3],[175,4,182,4],[175,5,182,5],[175,6,182,6],[175,7,182,7],[175,10,182,10],[167,3,174,3],[167,4,174,4],[167,5,174,5],[167,6,174,6],[167,7,174,7],[167,10,174,10],[191,3,198,3],[191,4,198,4],[191,5,198,5],[191,6,198,6],[191,7,198,7],[191,10,198,10],[183,3,190,3],[183,4,190,4],[183,5,190,5],[183,6,190,6],[183,7,190,7],[183,10,190,10],[58,1,65,1],[66,1,73,1],[74,1,81,1],[82,1,89,1],[90,1,97,1],[111,1,118,1],[10,1,17,1],[18,1,25,1],[26,1,33,1],[34,1,41,1],[42,1,49,1],[50,1,57,1],[167,1,174,1],[175,1,182,1],[183,1,190,1],[191,1,198,1],[119,1,126,1],[127,1,134,1],[135,1,142,1],[143,1,150,1],[151,1,158,1],[159,1,166,1]]}
[null,null,"# of Subcos","Phase 1 - Advance Payments"]
[null,null,{"$f":"Overview!B10","v":1},"Prime (P) / Subco (SI)","Company Name","Entity Code","Country\n(ISO Code)","Advance Payment (in EUR)","Off-Set against","Off-set by (amount in EUR)","Condition for release of the Advance Payment (if applicable)"]
[{"$f":"Consortium!$G$3","v":"Yes"},null,null,"P","Our Company","100 xxx-xxx","IT",50000,"Milestone 1",25000,"After signature of the Contract by both Parties"]
[{"$f":"$A$3","v":"Yes"},null,null,null,null,null,null,null,"Milestone 2",25000]
["Yes"]
["Yes"]
["Yes"]
["Yes"]
["Yes"]
["Yes"]
[{"$f":"Consortium!$G$4","v":"Yes"},1,1,"SI","Subco 1","100 xxx-xxx","AT",4000,"Milestone 1",2000,"After signature of the Contract by both Parties"]
[{"$f":"Consortium!$G$4","v":"Yes"},null,1,null,null,null,null,null,"Milestone 2",2000]
[{"$f":"Consortium!$G$4","v":"Yes"},null,1]
[{"$f":"Consortium!$G$4","v":"Yes"},null,1]
[{"$f":"Consortium!$G$4","v":"Yes"},null,1]
[{"$f":"Consortium!$G$4","v":"Yes"},null,1]
[{"$f":"Consortium!$G$4","v":"Yes"},null,1]
[{"$f":"Consortium!$G$4","v":"Yes"},null,1]
[{"$f":"Consortium!$G$5","v":"No"},{"$f":"B11+1","v":2},2]
[{"$f":"Consortium!$G$5","v":"No"},null,2]
[{"$f":"Consortium!$G$5","v":"No"},null,2]
[{"$f":"Consortium!$G$5","v":"No"},null,2]
[{"$f":"Consortium!$G$5","v":"No"},null,2]
[{"$f":"Consortium!$G$5","v":"No"},null,2]
[{"$f":"Consortium!$G$5","v":"No"},null,2]
[{"$f":"Consortium!$G$5","v":"No"},null,2]
[{"$f":"Consortium!$G$6","v":"No"},{"$f":"B19+1","v":3},3]
[{"$f":"Consortium!$G$6","v":"No"},null,3]
[{"$f":"Consortium!$G$6","v":"No"},null,3]
[{"$f":"Consortium!$G$6","v":"No"},null,3]
[{"$f":"Consortium!$G$6","v":"No"},null,3]
[{"$f":"Consortium!$G$6","v":"No"},null,3]
[{"$f":"Consortium!$G$6","v":"No"},null,3]
[{"$f":"Consortium!$G$6","v":"No"},null,3]
[{"$f":"Consortium!$G$7","v":"No"},{"$f":"B27+1","v":4},4]
[{"$f":"Consortium!$G$7","v":"No"},null,4]
[{"$f":"Consortium!$G$7","v":"No"},null,4]
[{"$f":"Consortium!$G$7","v":"No"},null,4]
[{"$f":"Consortium!$G$7","v":"No"},null,4]
[{"$f":"Consortium!$G$7","v":"No"},null,4]
[{"$f":"Consortium!$G$7","v":"No"},null,4]
[{"$f":"Consortium!$G$7","v":"No"},null,4]
[{"$f":"Consortium!$G$8","v":"No"},{"$f":"B35+1","v":5},5]
[{"$f":"Consortium!$G$8","v":"No"},null,5]
[{"$f":"Consortium!$G$8","v":"No"},null,5]
[{"$f":"Consortium!$G$8","v":"No"},null,5]
[{"$f":"Consortium!$G$8","v":"No"},null,5]
[{"$f":"Consortium!$G$8","v":"No"},null,5]
[{"$f":"Consortium!$G$8","v":"No"},null,5]
[{"$f":"Consortium!$G$8","v":"No"},null,5]
[{"$f":"Consortium!$G$9","v":"No"},{"$f":"B43+1","v":6},6]
[{"$f":"Consortium!$G$9","v":"No"},null,6]
[{"$f":"Consortium!$G$9","v":"No"},null,6]
[{"$f":"Consortium!$G$9","v":"No"},null,6]
[{"$f":"Consortium!$G$9","v":"No"},null,6]
[{"$f":"Consortium!$G$9","v":"No"},null,6]
[{"$f":"Consortium!$G$9","v":"No"},null,6]
[{"$f":"Consortium!$G$9","v":"No"},null,6]
[{"$f":"Consortium!$G$10","v":"No"},{"$f":"B51+1","v":7},7]
[{"$f":"Consortium!$G$10","v":"No"},null,7]
[{"$f":"Consortium!$G$10","v":"No"},null,7]
[{"$f":"Consortium!$G$10","v":"No"},null,7]
[{"$f":"Consortium!$G$10","v":"No"},null,7]
[{"$f":"Consortium!$G$10","v":"No"},null,7]
[{"$f":"Consortium!$G$10","v":"No"},null,7]
[{"$f":"Consortium!$G$10","v":"No"},null,7]
[{"$f":"Consortium!$G$11","v":"No"},{"$f":"B59+1","v":8},8]
[{"$f":"Consortium!$G$11","v":"No"},null,8]
[{"$f":"Consortium!$G$11","v":"No"},null,8]
[{"$f":"Consortium!$G$11","v":"No"},null,8]
[{"$f":"Consortium!$G$11","v":"No"},null,8]
[{"$f":"Consortium!$G$11","v":"No"},null,8]
[{"$f":"Consortium!$G$11","v":"No"},null,8]
[{"$f":"Consortium!$G$11","v":"No"},null,8]
[{"$f":"Consortium!$G$12","v":"No"},{"$f":"B67+1","v":9},9]
[{"$f":"Consortium!$G$12","v":"No"},null,9]
[{"$f":"Consortium!$G$12","v":"No"},null,9]
[{"$f":"Consortium!$G$12","v":"No"},null,9]
[{"$f":"Consortium!$G$12","v":"No"},null,9]
[{"$f":"Consortium!$G$12","v":"No"},null,9]
[{"$f":"Consortium!$G$12","v":"No"},null,9]
[{"$f":"Consortium!$G$12","v":"No"},null,9]
[{"$f":"Consortium!$G$13","v":"No"},{"$f":"B75+1","v":10},10]
[{"$f":"Consortium!$G$13","v":"No"},null,10]
[{"$f":"Consortium!$G$13","v":"No"},null,10]
[{"$f":"Consortium!$G$13","v":"No"},null,10]
[{"$f":"Consortium!$G$13","v":"No"},null,10]
[{"$f":"Consortium!$G$13","v":"No"},null,10]
[{"$f":"Consortium!$G$13","v":"No"},null,10]
[{"$f":"Consortium!$G$13","v":"No"},null,10]
[{"$f":"Consortium!$G$14","v":"No"},{"$f":"B83+1","v":11},11]
[{"$f":"Consortium!$G$14","v":"No"},null,11]
[{"$f":"Consortium!$G$14","v":"No"},null,11]
[{"$f":"Consortium!$G$14","v":"No"},null,11]
[{"$f":"Consortium!$G$14","v":"No"},null,11]
[{"$f":"Consortium!$G$14","v":"No"},null,11]
[{"$f":"Consortium!$G$14","v":"No"},null,11]
[{"$f":"Consortium!$G$14","v":"No"},null,11]
[]
[]
[]
[null,null,"# of Subcos","Phase 2 - Advance Payments"]
[null,null,{"$f":"Overview!B11","v":2},"Prime (P) / Subco (SI)","Company Name","Entity Code","Country\n(ISO Code)","Advance Payment (in EUR)","Off-Set against","Off-set by (amount in EUR)","Condition for release of the Advance Payment (if applicable)"]
[{"$f":"Consortium!$O$3","v":"Yes"},null,null,"P","Our Company","100 xxx-xxx","IT",50000,"Milestone 1",10000,"After signature of the Contract by both Parties"]
[{"$f":"Consortium!$O$3","v":"Yes"},null,null,null,null,null,null,null,"Milestone 2",10000]
[{"$f":"Consortium!$O$3","v":"Yes"},null,null,null,null,null,null,null,"Milestone 3",10000]
[{"$f":"Consortium!$O$3","v":"Yes"},null,null,null,null,null,null,null,"Milestone 4",10000]
[{"$f":"Consortium!$O$3","v":"Yes"}]
[{"$f":"Consortium!$O$3","v":"Yes"}]
[{"$f":"Consortium!$O$3","v":"Yes"}]
[{"$f":"Consortium!$O$3","v":"Yes"}]
[{"$f":"Consortium!$O$4","v":"No"},1,1]
[{"$f":"Consortium!$O$4","v":"No"},null,1]
[{"$f":"Consortium!$O$4","v":"No"},null,1]
[{"$f":"Consortium!$O$4","v":"No"},null,1]
[{"$f":"Consortium!$O$4","v":"No"},null,1]
[{"$f":"Consortium!$O$4","v":"No"},null,1]
[{"$f":"Consortium!$O$4","v":"No"},null,1]
[{"$f":"Consortium!$O$4","v":"No"},null,1]
[{"$f":"Consortium!$O$5","v":"No"},{"$f":"B112+1","v":2},2]
[{"$f":"Consortium!$O$5","v":"No"},null,2]
[{"$f":"Consortium!$O$5","v":"No"},null,2]
[{"$f":"Consortium!$O$5","v":"No"},null,2]
[{"$f":"Consortium!$O$5","v":"No"},null,2]
[{"$f":"Consortium!$O$5","v":"No"},null,2]
[{"$f":"Consortium!$O$5","v":"No"},null,2]
[{"$f":"Consortium!$O$5","v":"No"},null,2]
[{"$f":"Consortium!$O$6","v":"No"},{"$f":"B120+1","v":3},3]
[{"$f":"Consortium!$O$6","v":"No"},null,3]
[{"$f":"Consortium!$O$6","v":"No"},null,3]
[{"$f":"Consortium!$O$6","v":"No"},null,3]
[{"$f":"Consortium!$O$6","v":"No"},null,3]
[{"$f":"Consortium!$O$6","v":"No"},null,3]
[{"$f":"Consortium!$O$6","v":"No"},null,3]
[{"$f":"Consortium!$O$6","v":"No"},null,3]
[{"$f":"Consortium!$O$7","v":"No"},{"$f":"B128+1","v":4},4]
[{"$f":"Consortium!$O$7","v":"No"},null,4]
[{"$f":"Consortium!$O$7","v":"No"},null,4]
[{"$f":"Consortium!$O$7","v":"No"},null,4]
[{"$f":"Consortium!$O$7","v":"No"},null,4]
[{"$f":"Consortium!$O$7","v":"No"},null,4]
[{"$f":"Consortium!$O$7","v":"No"},null,4]
[{"$f":"Consortium!$O$7","v":"No"},null,4]
[{"$f":"Consortium!$O$8","v":"No"},{"$f":"B136+1","v":5},5]
[{"$f":"Consortium!$O$8","v":"No"},null,5]
[{"$f":"Consortium!$O$8","v":"No"},null,5]
[{"$f":"Consortium!$O$8","v":"No"},null,5]
[{"$f":"Consortium!$O$8","v":"No"},null,5]
[{"$f":"Consortium!$O$8","v":"No"},null,5]
[{"$f":"Consortium!$O$8","v":"No"},null,5]
[{"$f":"Consortium!$O$8","v":"No"},null,5]
[{"$f":"Consortium!$O$9","v":"No"},{"$f":"B144+1","v":6},6]
[{"$f":"Consortium!$O$9","v":"No"},null,6]
[{"$f":"Consortium!$O$9","v":"No"},null,6]
[{"$f":"Consortium!$O$9","v":"No"},null,6]
[{"$f":"Consortium!$O$9","v":"No"},null,6]
[{"$f":"Consortium!$O$9","v":"No"},null,6]
[{"$f":"Consortium!$O$9","v":"No"},null,6]
[{"$f":"Consortium!$O$9","v":"No"},null,6]
[{"$f":"Consortium!$O$10","v":"No"},{"$f":"B152+1","v":7},7]
[{"$f":"Consortium!$O$10","v":"No"},null,7]
[{"$f":"Consortium!$O$10","v":"No"},null,7]
[{"$f":"Consortium!$O$10","v":"No"},null,7]
[{"$f":"Consortium!$O$10","v":"No"},null,7]
[{"$f":"Consortium!$O$10","v":"No"},null,7]
[{"$f":"Consortium!$O$10","v":"No"},null,7]
[{"$f":"Consortium!$O$10","v":"No"},null,7]
[{"$f":"Consortium!$O$11","v":"No"},{"$f":"B160+1","v":8},8]
[{"$f":"Consortium!$O$11","v":"No"},null,8]
[{"$f":"Consortium!$O$11","v":"No"},null,8]
[{"$f":"Consortium!$O$11","v":"No"},null,8]
[{"$f":"Consortium!$O$11","v":"No"},null,8]
[{"$f":"Consortium!$O$11","v":"No"},null,8]
[{"$f":"Consortium!$O$11","v":"No"},null,8]
[{"$f":"Consortium!$O$11","v":"No"},null,8]
[{"$f":"Consortium!$O$12","v":"No"},{"$f":"B168+1","v":9},9]
[{"$f":"Consortium!$O$12","v":"No"},null,9]
[{"$f":"Consortium!$O$12","v":"No"},null,9]
[{"$f":"Consortium!$O$12","v":"No"},null,9]
[{"$f":"Consortium!$O$12","v":"No"},null,9]
[{"$f":"Consortium!$O$12","v":"No"},null,9]
[{"$f":"Consortium!$O$12","v":"No"},null,9]
[{"$f":"Consortium!$O$12","v":"No"},null,9]
[{"$f":"Consortium!$O$13","v":"No"},{"$f":"B176+1","v":10},10]
[{"$f":"Consortium!$O$13","v":"No"},null,10]
[{"$f":"Consortium!$O$13","v":"No"},null,10]
[{"$f":"Consortium!$O$13","v":"No"},null,10]
[{"$f":"Consortium!$O$13","v":"No"},null,10]
[{"$f":"Consortium!$O$13","v":"No"},null,10]
[{"$f":"Consortium!$O$13","v":"No"},null,10]
[{"$f":"Consortium!$O$13","v":"No"},null,10]
[{"$f":"Consortium!$O$14","v":"No"},{"$f":"B184+1","v":11},11]
[{"$f":"Consortium!$O$14","v":"No"},null,11]
[{"$f":"Consortium!$O$14","v":"No"},null,11]
[{"$f":"Consortium!$O$14","v":"No"},null,11]
[{"$f":"Consortium!$O$14","v":"No"},null,11]
[{"$f":"Consortium!$O$14","v":"No"},null,11]
[{"$f":"Consortium!$O$14","v":"No"},null,11]
[{"$f":"Consortium!$O$14","v":"No"},null,11]

{"sheet":"Contact","index":5,"n_rows":38,"n_cols":3,"rows_kept":38,"cut":false,"hidden":false,"merged":[[0,0,0,1],[12,0,12,1],[21,0,21,1],[30,0,30,1]]}
["Main Contact Person"]
[]
[null,"Prefix (Ms/Mr/Dr/etc.)","Mr."]
[null,"First Name","John"]
[null,"Last Name","Doe"]
[null,"Job Title","Head of Programs"]
[null,"Physical Address","My Address, 123"]
[null,"postal code","123-456"]
[null,"City","My City"]
[null,"Country","My Country"]
[null,"Complete Physical Address","My Address, 123 123-456 My City, My Country"]
[]
["Technical Officer - Company Side"]
[]
[null,"Prefix (Ms/Mr/Dr/etc.)","Mr."]
[null,"First Name","John"]
[null,"Last Name","Doe"]
[null,"Complete Physical Address","My Address, 123 123-456 My City, My Country"]
[null,"Phone","(+XX) 123 456 789"]
[null,"Email","myemail@myawesomecompany.com"]
[]
["Contract Officer - Company Side"]
[]
[null,"Prefix (Ms/Mr/Dr/etc.)","Ms."]
[null,"First Name","Julianne"]
[null,"Last Name","Foo"]
[null,"Complete Physical Address","My Address, 123 123-456 My City, My Country"]
[null,"Phone","(+XX) 123 456 789"]
[null,"Email","myemail@myawesomecompany.com"]
[]
["Data Protection Officer - Company Side"]
[]
[null,"Prefix (Ms/Mr/Dr/etc.)","Mr."]
[null,"First Name","Mark"]
[null,"Last Name","Smith"]
[null,"Complete Physical Address","My Address, 123 123-456 My City, My Country"]
[null,"Phone","(+XX) 123 456 789"]
[null,"Email","myemail@myawesomecompany.com"]

{"sheet":"FlightItem","index":6,"n_rows":33,"n_cols":3,"rows_kept":33,"cut":false,"hidden":false,"merged":[]}
["existence of a flight item","Yes"]
["name of the flight item","some sub-system"]
["Deadline to deliver the hardware to the launch authority","2024-01-15"]
["Deadline for alternative flight opportunity","2024-06-15"]
["Is the satellite operator different from the prime contractor ?","No"]
[]
[]
[]
[]
[]
[]
[]
[]
[]
[]
[]
[]
[]
[]
[]
[]
[]
[]
[]
[]
[]
[]
[]
[]
[]
[]
[]
[null,null,"No"]

{"sheet":"Deliverables","index":7,"n_rows":137,"n_cols":12,"rows_kept":137,"cut":false,"hidden":false,"merged":[[28,1,28,11],[69,1,69,11],[95,1,95,11],[116,1,116,11],[0,1,0,3],[0,4,0,11],[2,1,2,11]]}
[null,"Documents\n(InCubed Deliverables List is available at:\nhttps://incubed.esa.int/wp-content/uploads/sites/2/2021/09/InCubed-deliverables.xlsx)",null,null,"Review Data Package\nN: New issue to be delivered at the indicated review\nU: Updated issue to be delivered at the indicated review\nC: Document already delivered and under configuration control"]
[null,"ID","TITLE","ACRONYM",{"$f":"IF(Overview!B3=\"Space Segment\",\"RR\",IF(Overview!B3=\"Ground Segment\",\"RR\",IF(Overview!B3=\"Data Segment\",\"RR\",\"MS1\")))","v":"RR"},{"$f":"IF(Overview!B3=\"Space Segment\",\"PDR\",IF(Overview!B3=\"Ground Segment\",\"PDR\",IF(Overview!B3=\"Data Segment\",\"CDR\",\"MS2\")))","v":"PDR"},{"$f":"IF(Overview!B3=\"Space Segment\",\"CDR\",IF(Overview!B3=\"Ground Segment\",\"CDR\",IF(Overview!B3=\"Data Segment\",\"FAT\",\"MS3\")))","v":"CDR"},{"$f":"IF(Overview!B3=\"Space Segment\",\"TRR\",IF(Overview!B3=\"Ground Segment\",\"FAT\",IF(Overview!B3=\"Data Segment\",\"SAT\",\"MS4\")))","v":"TRR"},{"$f":"IF(Overview!B3=\"Space Segment\",\"QAR\",IF(Overview!B3=\"Ground Segment\",\"SAT\",IF(Overview!B3=\"Data Segment\",\"DCCR\",\"MS5\")))","v":"QAR"},{"$f":"IF(Overview!B3=\"Space Segment\",\"IOCR\",IF(Overview!B3=\"Ground Segment\",\"DCCR\",IF(Overview!B3=\"Data Segment\",\"FR\",\"MS6\")))","v":"IOCR"},{"$f":"IF(Overview!B3=\"Space Segment\",\"DCCR\",IF(Overview!B3=\"Ground Segment\",\"FR\",IF(Overview!B3=\"Data Segment\",\"\",\"MS7\")))","v":"DCCR"},{"$f":"IF(Overview!B3=\"Space Segment\",\"FR\",IF(Overview!B3=\"Ground Segment\",\"\",IF(Overview!B3=\"Data Segment\",\"\",\"MS8\")))","v":"FR"}]
[null,"MANAGEMENT"]
[1,{"$f":"IF(Overview!$B$3=\"Space Segment\", \"S\", IF(Overview!$B$3=\"Ground Segment\",\"G\",\"D\"))&\".MG\"&TEXT(A4,\"00\")","v":"S.MG01"},"Configuration and Documentation Management Plan","CMDP",{"$f":"IF(Overview!B3=\"\",\"\",\"N\")","v":"N"},{"$f":"IF(Overview!B3=\"\",\"\",\"U\")","v":"U"},null,null,{"$f":"IF(Overview!B3=\"Data Segment\",\"C\",\"\")","v":""},{"$f":"IF(OR(Overview!B3=\"Ground Segment\",Overview!B3=\"Data Segment\"),\"C\",\"\")","v":""},{"$f":"IF(OR(Overview!B3=\"Ground Segment\",Overview!B3=\"Space Segment\"),\"C\",\"\")","v":"C"},{"$f":"IF(Overview!B3=\"Space Segment\",\"C\",\"\")","v":"C"}]
[2,{"$f":"IF(Overview!$B$3=\"Space Segment\", \"S\", IF(Overview!$B$3=\"Ground Segment\",\"G\",\"D\"))&\".MG\"&TEXT(A5,\"00\")","v":"S.MG02"},"Risk Register","RR",{"$f":"IF(Overview!B3=\"\",\"\",\"Monthly and at each progress meeting/review\")","v":"Monthly and at each progress meeting/review"}]
[3,{"$f":"IF(Overview!$B$3=\"Space Segment\", \"S\", IF(Overview!$B$3=\"Ground Segment\",\"G\",\"D\"))&\".MG\"&TEXT(A6,\"00\")","v":"S.MG03"},"Business Plan","BP",{"$f":"IF(Overview!B3=\"\",\"\",\"N\")","v":"N"},{"$f":"IF(Overview!B3=\"\",\"\",\"U\")","v":"U"},{"$f":"IF(Overview!B3=\"\",\"\",\"U\")","v":"U"},{"$f":"IF(Overview!B3=\"\",\"\",\"U\")","v":"U"},{"$f":"IF(Overview!B3=\"\",\"\",\"U\")","v":"U"},{"$f":"IF(Overview!B3=\"\",\"\",\"U\")","v":"U"},{"$f":"IF(OR(Overview!B3=\"Ground Segment\",Overview!B3=\"Space Segment\"),\"U\",\"\")","v":"U"},{"$f":"IF(Overview!B3=\"Space Segment\",\"U\",\"\")","v":"U"}]
[4,{"$f":"IF(Overview!$B$3=\"Space Segment\", \"S\", IF(Overview!$B$3=\"Ground Segment\",\"G\",\"D\"))&\".MG\"&TEXT(A7,\"00\")","v":"S.MG04"},"Document List","DL",{"$f":"IF(Overview!B3=\"\",\"\",\"N\")","v":"N"},{"$f":"IF(Overview!B3=\"\",\"\",\"U\")","v":"U"},{"$f":"IF(Overview!B3=\"\",\"\",\"U\")","v":"U"},{"$f":"IF(Overview!B3=\"\",\"\",\"U\")","v":"U"},{"$f":"IF(Overview!B3=\"\",\"\",\"U\")","v":"U"},{"$f":"IF(Overview!B3=\"\",\"\",\"U\")","v":"U"},{"$f":"IF(OR(Overview!B3=\"Ground Segment\",Overview!B3=\"Space Segment\"),\"U\",\"\")","v":"U"},{"$f":"IF(Overview!B3=\"Space Segment\",\"U\",\"\")","v":"U"}]
[5,{"$f":"IF(Overview!$B$3=\"Space Segment\", \"S\", IF(Overview!$B$3=\"Ground Segment\",\"G\",\"D\"))&\".MG\"&TEXT(A8,\"00\")","v":"S.MG05"},"Monthly Progress Report","MPR",{"$f":"IF(Overview!B3=\"\",\"\",\"Monthly\")","v":"Monthly"}]
[6,{"$f":"IF(Overview!$B$3=\"Space Segment\", \"S\", IF(Overview!$B$3=\"Ground Segment\",\"G\",\"D\"))&\".MG\"&TEXT(A9,\"00\")","v":"S.MG06"},"Minutes of the Meeting","MoM",{"$f":"IF(Overview!B3=\"\",\"\",\"N\")","v":"N"},{"$f":"IF(Overview!B3=\"\",\"\",\"N\")","v":"N"},{"$f":"IF(Overview!B3=\"\",\"\",\"N\")","v":"N"},{"$f":"IF(Overview!B3=\"\",\"\",\"N\")","v":"N"},{"$f":"IF(Overview!B3=\"\",\"\",\"N\")","v":"N"},{"$f":"IF(Overview!B3=\"\",\"\",\"N\")","v":"N"},{"$f":"IF(OR(Overview!B3=\"Ground Segment\",Overview!B3=\"Space Segment\"),\"N\",\"\")","v":"N"},{"$f":"IF(Overview!B3=\"Space Segment\",\"N\",\"\")","v":"N"}]
[7,{"$f":"IF(Overview!$B$3=\"Space Segment\", \"S\", IF(Overview!$B$3=\"Ground Segment\",\"G\",\"D\"))&\".MG\"&TEXT(A10,\"00\")","v":"S.MG07"},"Activity Web Page","AWP",{"$f":"IF(Overview!B3=\"\",\"\",\"At the first review meeting and current status updated at each review\")","v":"At the first review meeting and current status updated at each review"}]
[8,{"$f":"IF(Overview!$B$3=\"Space Segment\", \"S\", IF(Overview!$B$3=\"Ground Segment\",\"G\",\"D\"))&\".MG\"&TEXT(A11,\"00\")","v":"S.MG08"},"Justification for non continuation","JFNC",null,null,null,null,{"$f":"IF(Overview!B3=\"Data Segment\",\"N\",\"\")","v":""},{"$f":"IF(Overview!B3=\"Ground Segment\",\"N\",\"\")","v":""},{"$f":"IF(Overview!B3=\"Space Segment\",\"N\",\"\")","v":"N"}]
[9,{"$f":"IF(Overview!$B$3=\"Space Segment\", \"S\", IF(Overview!$B$3=\"Ground Segment\",\"G\",\"D\"))&\".MG\"&TEXT(A12,\"00\")","v":"S.MG09"},"Digital Media","DM",null,null,null,null,{"$f":"IF(Overview!B3=\"Data Segment\",\"N\",\"\")","v":""},{"$f":"IF(OR(Overview!B3=\"Ground Segment\",Overview!B3=\"Data Segment\"),\"N\",\"\")","v":""},{"$f":"IF(OR(Overview!B3=\"Space Segment\",Overview!B3=\"Ground Segment\"),\"N\",\"\")","v":"N"},{"$f":"IF(Overview!B3=\"Space Segment\",\"N\",\"\")","v":"N"}]
[10,{"$f":"IF(Overview!$B$3=\"Space Segment\", \"S\", IF(Overview!$B$3=\"Ground Segment\",\"G\",\"D\"))&\".MG\"&TEXT(A13,\"00\")","v":"S.MG10"},"Product Data Sheet","PDS",null,null,null,null,null,{"$f":"IF(Overview!B3=\"Data Segment\",\"N\",\"\")","v":""},{"$f":"IF(Overview!B3=\"Ground Segment\",\"N\",\"\")","v":""},{"$f":"IF(Overview!B3=\"Space Segment\",\"N\",\"\")","v":"N"}]
[11,{"$f":"IF(Overview!$B$3=\"Space Segment\", \"S\", IF(Overview!$B$3=\"Ground Segment\",\"G\",\"D\"))&\".MG\"&TEXT(A14,\"00\")","v":"S.MG11"},"CCN for follow-on Cycle(s)","CCN-FOC",null,null,null,null,{"$f":"IF(Overview!B3=\"Data Segment\",\"N\",\"\")","v":""},{"$f":"IF(Overview!B3=\"Ground Segment\",\"N\",\"\")","v":""},{"$f":"IF(Overview!B3=\"Space Segment\",\"N\",\"\")","v":"N"}]
[12,{"$f":"IF(Overview!$B$3=\"Space Segment\", \"S\", IF(Overview!$B$3=\"Ground Segment\",\"G\",\"D\"))&\".MG\"&TEXT(A15,\"00\")","v":"S.MG12"},"Contract Achievements and Socio Economic Impact Questionnaire","CA-SEIQ",null,null,null,null,{"$f":"IF(Overview!B3=\"Data Segment\",\"N\",\"\")","v":""},{"$f":"IF(OR(Overview!B3=\"Ground Segment\",Overview!B3=\"Data Segment\"),\"N\",\"\")","v":""},{"$f":"IF(OR(Overview!B3=\"Space Segment\",Overview!B3=\"Ground Segment\"),\"N\",\"\")","v":"N"},{"$f":"IF(Overview!B3=\"Space Segment\",\"N\",\"\")","v":"N"}]
[13,{"$f":"IF(Overview!$B$3=\"Space Segment\", \"S\", IF(Overview!$B$3=\"Ground Segment\",\"G\",\"D\"))&\".MG\"&TEXT(A16,\"00\")","v":"S.MG13"},"Final Data Package","FDP",null,null,null,null,{"$f":"IF(Overview!B3=\"Data Segment\",\"N\",\"\")","v":""},{"$f":"IF(OR(Overview!B3=\"Ground Segment\",Overview!B3=\"Data Segment\"),\"N\",\"\")","v":""},{"$f":"IF(OR(Overview!B3=\"Space Segment\",Overview!B3=\"Ground Segment\"),\"N\",\"\")","v":"N"},{"$f":"IF(Overview!B3=\"Space Segment\",\"N\",\"\")","v":"N"}]
[14,{"$f":"IF(Overview!$B$3=\"Space Segment\", \"S\", IF(Overview!$B$3=\"Ground Segment\",\"G\",\"D\"))&\".MG\"&TEXT(A17,\"00\")","v":"S.MG14"},"Final Report","FREP",null,null,null,null,{"$f":"IF(Overview!B3=\"Data Segment\",\"N\",\"\")","v":""},{"$f":"IF(OR(Overview!B3=\"Ground Segment\",Overview!B3=\"Data Segment\"),\"N\",\"\")","v":""},{"$f":"IF(OR(Overview!B3=\"Space Segment\",Overview!B3=\"Ground Segment\"),\"N\",\"\")","v":"N"},{"$f":"IF(Overview!B3=\"Space Segment\",\"N\",\"\")","v":"N"}]
[15]
[16]
[17]
[18]
[19]
[20]
[21]
[22]
[23]
[24]
[25]
[null,"ENGINEERING"]
[1,{"$f":"IF(Overview!$B$3=\"Space Segment\", \"S\", IF(Overview!$B$3=\"Ground Segment\",\"G\",\"D\"))&\".EN\"&TEXT(A30,\"00\")","v":"S.EN01"},"Engineering Document #1","ACR#1","N","U","U","U","U","U","U","U"]
[2,"S.EN02","Engineering Document #2","ACR#2","N","U","U","U","U","U","U","U"]
[3,"S.EN03","Engineering Document #3","ACR#3",null,null,"N","U","U","U","C","C"]
[4,"S.EN04","Engineering Document #4","ACR#4","N",null," ","U","U","U","C","C"]
[5,"S.EN05","Engineering Document #5","ACR#5",null,null," ","N","U","U","C","C"]
[6]
[7]
[8]
[9]
[10]
[11]
[12]
[13]
[14]
[15]
[16]
[17]
[18]
[19]
[20]
[21]
[22]
[23]
[24]
[25]
[26]
[27]
[28]
[29]
[30]
[31]
[32]
[33]
[34]
[35]
[36]
[37]
[38]
[39]
[40]
[null,"TESTING"]
[1,{"$f":"IF(Overview!$B$3=\"Space Segment\", \"S\", IF(Overview!$B$3=\"Ground Segment\",\"G\",\"D\"))&\".TE\"&TEXT(A71,\"00\")","v":"S.TE01"},"Testing Document #1","ACR#6",null,null," ","N","U","U","C","C"]
[2,"S.TE02","Testing Document #2","ACR#7",null,null,"N",null,"U","U","C","C"]
[3,"S.TE03","Testing Document #3","ACR#8",null,null,"N",null,"U","U","C","C"]
[4]
[5]
[6]
[7]
[8]
[9]
[10]
[11]
[12]
[13]
[14]
[15]
[16]
[17]
[18]
[19]
[20]
[21]
[22]
[23]
[24]
[25]
[null,"PRODUCT ASSURANCE"]
[1,{"$f":"IF(Overview!$B$3=\"Space Segment\", \"S\", IF(Overview!$B$3=\"Ground Segment\",\"G\",\"D\"))&\".PA\"&TEXT(A97,\"00\")","v":"S.PA01"},"PA Document #1","ACR#9",null,null," ","N","U","U","C","C"]
[2,"S.PA02","PA Document #2","ACR#10",null,null,"N",null,"U","U","C","C"]
[3]
[4]
[5]
[6]
[7]
[8]
[9]
[10]
[11]
[12]
[13]
[14]
[15]
[16]
[17]
[18]
[19]
[20]
[null,"SOFTWARE"]
[1,{"$f":"IF(Overview!$B$3=\"Space Segment\", \"S\", IF(Overview!$B$3=\"Ground Segment\",\"G\",\"D\"))&\".SW\"&TEXT(A118,\"00\")","v":"S.SW01"},"SW Document #1","ACR#11","N","U","U","U","U","U","U","U"]
[2,"S.SW02","SW Document #2","ACR#12",null,null,"N","U","U","U","C","C"]
[3]
[4]
[5]
[6]
[7]
[8]
[9]
[10]
[11]
[12]
[13]
[14]
[15]
[16]
[17]
[18]
[19]
[20]

{"sheet":"BIPRs","index":8,"n_rows":8,"n_cols":10,"rows_kept":8,"cut":false,"hidden":false,"merged":[]}
[]
[null,"List of BIPRs (max 4 items)"]
["# of Milestones"]
[{"$f":"Overview!B31","v":1},"Exact Name of BIPR Item","Owner","Description","Patent # or Ref. / Issue / Revision / Version #","Contract / Funding Details under which the IPR was created","Date of creation of the version of the BIPR listed here","Type of License","Affected deliverables with comments","Protected Format (Y/N)"]
[1,"My Awesome BIPR Item"]
[2]
[3]
[4]

{"sheet":"TableConsortium","index":9,"n_rows":20,"n_cols":12,"rows_kept":20,"cut":false,"hidden":false,"merged":[]}
["Phase 1",null,null,null,null,null,null,"Phase 2"]
["Entity","Country \n(ISO Code)","Role","Total Cost \nin EUR","Total Price \nin EUR",null,null,"Entity","Country \n(ISO Code)","Role","Total Cost \nin EUR","Total Price \nin EUR"]
[{"$f":"IF(Consortium!B3=\"\",\"\",Consortium!B3)","v":"Our company"},{"$f":"IF(Consortium!B3=\"\",\"\",Consortium!C3)","v":"IT"},"Contractor",{"$f":"Consortium!E3","v":1000000},{"$f":"Consortium!F3","v":500000},null,null,{"$f":"IF(Consortium!J3=\"\",\"\",Consortium!J3)","v":"Our company"},{"$f":"IF(Consortium!J3=\"\",\"\",Consortium!K3)","v":"IT"},{"$f":"IF(Consortium!I3<=Consortium!$I$2,\"Contractor\",IF(AND(Consortium!I3=Consortium!$I$2+1,Overview!B9=2),\"Total\",\"\"))","v":"Contractor"},{"$f":"IF(Consortium!M3=\"\",\"\",Consortium!M3)","v":1000000},{"$f":"IF(Consortium!N3=\"\",\"\",Consortium!N3)","v":600000}]
[{"$f":"IF(Consortium!A4<=Consortium!$A$2,Consortium!B4,\"\")","v":"Subco 1"},{"$f":"IF(A4=\"\",\"\",IF(A4=\"Total\",\"\",Consortium!C4))","v":"AT"},{"$f":"IF(Consortium!A4<=Consortium!$A$2,\"Subcontractor\",IF(Consortium!A4=Consortium!$A$2+1,\"Total\",\"\"))","v":"Subcontractor"},{"$f":"IF(C4=\"\",\"\",IF(C4=\"Total\",SUM(Consortium!E3:E14),Consortium!E4))","v":50000},{"$f":"IF(C4=\"\",\"\",IF(C4=\"Total\",SUM(Consortium!F3:F14),Consortium!F4))","v":25000},null,null,{"$f":"IF(Consortium!I4<=Consortium!$I$2,Consortium!J4,\"\")","v":"Subco 1"},{"$f":"IF(H4=\"\",\"\",IF(H4=\"Total\",\"\",Consortium!K4))","v":"AT"},{"$f":"IF(Consortium!I4<=Consortium!$I$2,\"Subcontractor\",IF(AND(Consortium!I4=Consortium!$I$2+1,Overview!$B$9=2),\"Total\",\"\"))","v":"Subcontractor"},{"$f":"IF(J4=\"\",\"\",IF(J4=\"Total\",SUM(Consortium!M3:M14),Consortium!M4))","v":200000},{"$f":"IF(J4=\"\",\"\",IF(J4=\"Total\",SUM(Consortium!N3:N14),Consortium!N4))","v":100000}]
[{"$f":"IF(Consortium!A5<=Consortium!$A$2,Consortium!B5,\"\")","v":""},{"$f":"IF(A5=\"\",\"\",IF(A5=\"Total\",\"\",Consortium!C5))","v":""},{"$f":"IF(Consortium!A5<=Consortium!$A$2,\"Subcontractor\",IF(Consortium!A5=Consortium!$A$2+1,\"Total\",\"\"))","v":"Total"},{"$f":"IF(C5=\"\",\"\",IF(C5=\"Total\",SUM(Consortium!E3:E14),Consortium!E5))","v":1050000},{"$f":"IF(C5=\"\",\"\",IF(C5=\"Total\",SUM(Consortium!F3:F14),Consortium!F5))","v":525000},null,null,{"$f":"IF(Consortium!I5<=Consortium!$I$2,Consortium!J5,\"\")","v":"Subco 2"},{"$f":"IF(H5=\"\",\"\",IF(H5=\"Total\",\"\",Consortium!K5))","v":"DE"},{"$f":"IF(Consortium!I5<=Consortium!$I$2,\"Subcontractor\",IF(AND(Consortium!I5=Consortium!$I$2+1,Overview!$B$9=2),\"Total\",\"\"))","v":"Subcontractor"},{"$f":"IF(J5=\"\",\"\",IF(J5=\"Total\",SUM(Consortium!M3:M14),Consortium!M5))","v":180000},{"$f":"IF(J5=\"\",\"\",IF(J5=\"Total\",SUM(Consortium!N3:N14),Consortium!N5))","v":90000}]
[{"$f":"IF(Consortium!A6<=Consortium!$A$2,Consortium!B6,\"\")","v":""},{"$f":"IF(A6=\"\",\"\",IF(A6=\"Total\",\"\",Consortium!C6))","v":""},{"$f":"IF(Consortium!A6<=Consortium!$A$2,\"Subcontractor\",IF(Consortium!A6=Consortium!$A$2+1,\"Total\",\"\"))","v":""},{"$f":"IF(C6=\"\",\"\",IF(C6=\"Total\",SUM(Consortium!E3:E14),Consortium!E6))","v":""},{"$f":"IF(C6=\"\",\"\",IF(C6=\"Total\",SUM(Consortium!F3:F14),Consortium!F6))","v":""},null,null,{"$f":"IF(Consortium!I6<=Consortium!$I$2,Consortium!J6,\"\")","v":""},{"$f":"IF(H6=\"\",\"\",IF(H6=\"Total\",\"\",Consortium!K6))","v":""},{"$f":"IF(Consortium!I6<=Consortium!$I$2,\"Subcontractor\",IF(AND(Consortium!I6=Consortium!$I$2+1,Overview!$B$9=2),\"Total\",\"\"))","v":"Total"},{"$f":"IF(J6=\"\",\"\",IF(J6=\"Total\",SUM(Consortium!M3:M14),Consortium!M6))","v":1380000},{"$f":"IF(J6=\"\",\"\",IF(J6=\"Total\",SUM(Consortium!N3:N14),Consortium!N6))","v":790000}]
[{"$f":"IF(Consortium!A7<=Consortium!$A$2,Consortium!B7,\"\")","v":""},{"$f":"IF(A7=\"\",\"\",IF(A7=\"Total\",\"\",Consortium!C7))","v":""},{"$f":"IF(Consortium!A7<=Consortium!$A$2,\"Subcontractor\",IF(Consortium!A7=Consortium!$A$2+1,\"Total\",\"\"))","v":""},{"$f":"IF(C7=\"\",\"\",IF(C7=\"Total\",SUM(Consortium!E3:E14),Consortium!E7))","v":""},{"$f":"IF(C7=\"\",\"\",IF(C7=\"Total\",SUM(Consortium!F3:F14),Consortium!F7))","v":""},null,null,{"$f":"IF(Consortium!I7<=Consortium!$I$2,Consortium!J7,\"\")","v":""},{"$f":"IF(H7=\"\",\"\",IF(H7=\"Total\",\"\",Consortium!K7))","v":""},{"$f":"IF(Consortium!I7<=Consortium!$I$2,\"Subcontractor\",IF(AND(Consortium!I7=Consortium!$I$2+1,Overview!$B$9=2),\"Total\",\"\"))","v":""},{"$f":"IF(J7=\"\",\"\",IF(J7=\"Total\",SUM(Consortium!M3:M14),Consortium!M7))","v":""},{"$f":"IF(J7=\"\",\"\",IF(J7=\"Total\",SUM(Consortium!N3:N14),Consortium!N7))","v":""}]
[{"$f":"IF(Consortium!A8<=Consortium!$A$2,Consortium!B8,\"\")","v":""},{"$f":"IF(A8=\"\",\"\",IF(A8=\"Total\",\"\",Consortium!C8))","v":""},{"$f":"IF(Consortium!A8<=Consortium!$A$2,\"Subcontractor\",IF(Consortium!A8=Consortium!$A$2+1,\"Total\",\"\"))","v":""},{"$f":"IF(C8=\"\",\"\",IF(C8=\"Total\",SUM(Consortium!E3:E14),Consortium!E8))","v":""},{"$f":"IF(C8=\"\",\"\",IF(C8=\"Total\",SUM(Consortium!F3:F14),Consortium!F8))","v":""},null,null,{"$f":"IF(Consortium!I8<=Consortium!$I$2,Consortium!J8,\"\")","v":""},{"$f":"IF(H8=\"\",\"\",IF(H8=\"Total\",\"\",Consortium!K8))","v":""},{"$f":"IF(Consortium!I8<=Consortium!$I$2,\"Subcontractor\",IF(AND(Consortium!I8=Consortium!$I$2+1,Overview!$B$9=2),\"Total\",\"\"))","v":""},{"$f":"IF(J8=\"\",\"\",IF(J8=\"Total\",SUM(Consortium!M3:M14),Consortium!M8))","v":""},{"$f":"IF(J8=\"\",\"\",IF(J8=\"Total\",SUM(Consortium!N3:N14),Consortium!N8))","v":""}]
[{"$f":"IF(Consortium!A9<=Consortium!$A$2,Consortium!B9,\"\")","v":""},{"$f":"IF(A9=\"\",\"\",IF(A9=\"Total\",\"\",Consortium!C9))","v":""},{"$f":"IF(Consortium!A9<=Consortium!$A$2,\"Subcontractor\",IF(Consortium!A9=Consortium!$A$2+1,\"Total\",\"\"))","v":""},{"$f":"IF(C9=\"\",\"\",IF(C9=\"Total\",SUM(Consortium!E3:E14),Consortium!E9))","v":""},{"$f":"IF(C9=\"\",\"\",IF(C9=\"Total\",SUM(Consortium!F3:F14),Consortium!F9))","v":""},null,null,{"$f":"IF(Consortium!I9<=Consortium!$I$2,Consortium!J9,\"\")","v":""},{"$f":"IF(H9=\"\",\"\",IF(H9=\"Total\",\"\",Consortium!K9))","v":""},{"$f":"IF(Consortium!I9<=Consortium!$I$2,\"Subcontractor\",IF(AND(Consortium!I9=Consortium!$I$2+1,Overview!$B$9=2),\"Total\",\"\"))","v":""},{"$f":"IF(J9=\"\",\"\",IF(J9=\"Total\",SUM(Consortium!M3:M14),Consortium!M9))","v":""},{"$f":"IF(J9=\"\",\"\",IF(J9=\"Total\",SUM(Consortium!N3:N14),Consortium!N9))","v":""}]
[{"$f":"IF(Consortium!A10<=Consortium!$A$2,Consortium!B10,\"\")","v":""},{"$f":"IF(A10=\"\",\"\",IF(A10=\"Total\",\"\",Consortium!C10))","v":""},{"$f":"IF(Consortium!A10<=Consortium!$A$2,\"Subcontractor\",IF(Consortium!A10=Consortium!$A$2+1,\"Total\",\"\"))","v":""},{"$f":"IF(C10=\"\",\"\",IF(C10=\"Total\",SUM(Consortium!E3:E14),Consortium!E10))","v":""},{"$f":"IF(C10=\"\",\"\",IF(C10=\"Total\",SUM(Consortium!F3:F14),Consortium!F10))","v":""},null,null,{"$f":"IF(Consortium!I10<=Consortium!$I$2,Consortium!J10,\"\")","v":""},{"$f":"IF(H10=\"\",\"\",IF(H10=\"Total\",\"\",Consortium!K10))","v":""},{"$f":"IF(Consortium!I10<=Consortium!$I$2,\"Subcontractor\",IF(AND(Consortium!I10=Consortium!$I$2+1,Overview!$B$9=2),\"Total\",\"\"))","v":""},{"$f":"IF(J10=\"\",\"\",IF(J10=\"Total\",SUM(Consortium!M3:M14),Consortium!M10))","v":""},{"$f":"IF(J10=\"\",\"\",IF(J10=\"Total\",SUM(Consortium!N3:N14),Consortium!N10))","v":""}]
[{"$f":"IF(Consortium!A11<=Consortium!$A$2,Consortium!B11,\"\")","v":""},{"$f":"IF(A11=\"\",\"\",IF(A11=\"Total\",\"\",Consortium!C11))","v":""},{"$f":"IF(Consortium!A11<=Consortium!$A$2,\"Subcontractor\",IF(Consortium!A11=Consortium!$A$2+1,\"Total\",\"\"))","v":""},{"$f":"IF(C11=\"\",\"\",IF(C11=\"Total\",SUM(Consortium!E3:E14),Consortium!E11))","v":""},{"$f":"IF(C11=\"\",\"\",IF(C11=\"Total\",SUM(Consortium!F3:F14),Consortium!F11))","v":""},null,null,{"$f":"IF(Consortium!I11<=Consortium!$I$2,Consortium!J11,\"\")","v":""},{"$f":"IF(H11=\"\",\"\",IF(H11=\"Total\",\"\",Consortium!K11))","v":""},{"$f":"IF(Consortium!I11<=Consortium!$I$2,\"Subcontractor\",IF(AND(Consortium!I11=Consortium!$I$2+1,Overview!$B$9=2),\"Total\",\"\"))","v":""},{"$f":"IF(J11=\"\",\"\",IF(J11=\"Total\",SUM(Consortium!M3:M14),Consortium!M11))","v":""},{"$f":"IF(J11=\"\",\"\",IF(J11=\"Total\",SUM(Consortium!N3:N14),Consortium!N11))","v":""}]
[{"$f":"IF(Consortium!A12<=Consortium!$A$2,Consortium!B12,\"\")","v":""},{"$f":"IF(A12=\"\",\"\",IF(A12=\"Total\",\"\",Consortium!C12))","v":""},{"$f":"IF(Consortium!A12<=Consortium!$A$2,\"Subcontractor\",IF(Consortium!A12=Consortium!$A$2+1,\"Total\",\"\"))","v":""},{"$f":"IF(C12=\"\",\"\",IF(C12=\"Total\",SUM(Consortium!E3:E14),Consortium!E12))","v":""},{"$f":"IF(C12=\"\",\"\",IF(C12=\"Total\",SUM(Consortium!F3:F14),Consortium!F12))","v":""},null,null,{"$f":"IF(Consortium!I12<=Consortium!$I$2,Consortium!J12,\"\")","v":""},{"$f":"IF(H12=\"\",\"\",IF(H12=\"Total\",\"\",Consortium!K12))","v":""},{"$f":"IF(Consortium!I12<=Consortium!$I$2,\"Subcontractor\",IF(AND(Consortium!I12=Consortium!$I$2+1,Overview!$B$9=2),\"Total\",\"\"))","v":""},{"$f":"IF(J12=\"\",\"\",IF(J12=\"Total\",SUM(Consortium!M3:M14),Consortium!M12))","v":""},{"$f":"IF(J12=\"\",\"\",IF(J12=\"Total\",SUM(Consortium!N3:N14),Consortium!N12))","v":""}]
[{"$f":"IF(Consortium!A13<=Consortium!$A$2,Consortium!B13,\"\")","v":""},{"$f":"IF(A13=\"\",\"\",IF(A13=\"Total\",\"\",Consortium!C13))","v":""},{"$f":"IF(Consortium!A13<=Consortium!$A$2,\"Subcontractor\",IF(Consortium!A13=Consortium!$A$2+1,\"Total\",\"\"))","v":""},{"$f":"IF(C13=\"\",\"\",IF(C13=\"Total\",SUM(Consortium!E3:E14),Consortium!E13))","v":""},{"$f":"IF(C13=\"\",\"\",IF(C13=\"Total\",SUM(Consortium!F3:F14),Consortium!F13))","v":""},null,null,{"$f":"IF(Consortium!I13<=Consortium!$I$2,Consortium!J13,\"\")","v":""},{"$f":"IF(H13=\"\",\"\",IF(H13=\"Total\",\"\",Consortium!K13))","v":""},{"$f":"IF(Consortium!I13<=Consortium!$I$2,\"Subcontractor\",IF(AND(Consortium!I13=Consortium!$I$2+1,Overview!$B$9=2),\"Total\",\"\"))","v":""},{"$f":"IF(J13=\"\",\"\",IF(J13=\"Total\",SUM(Consortium!M3:M14),Consortium!M13))","v":""},{"$f":"IF(J13=\"\",\"\",IF(J13=\"Total\",SUM(Consortium!N3:N14),Consortium!N13))","v":""}]
[{"$f":"IF(Consortium!A14<=Consortium!$A$2,Consortium!B14,\"\")","v":""},{"$f":"IF(A14=\"\",\"\",IF(A14=\"Total\",\"\",Consortium!C14))","v":""},{"$f":"IF(Consortium!A14<=Consortium!$A$2,\"Subcontractor\",IF(Consortium!A14=Consortium!$A$2+1,\"Total\",\"\"))","v":""},{"$f":"IF(C14=\"\",\"\",IF(C14=\"Total\",SUM(Consortium!E3:E14),Consortium!E14))","v":""},{"$f":"IF(C14=\"\",\"\",IF(C14=\"Total\",SUM(Consortium!F3:F14),Consortium!F14))","v":""},null,null,{"$f":"IF(Consortium!I14<=Consortium!$I$2,Consortium!J14,\"\")","v":""},{"$f":"IF(H14=\"\",\"\",IF(H14=\"Total\",\"\",Consortium!K14))","v":""},{"$f":"IF(Consortium!I14<=Consortium!$I$2,\"Subcontractor\",IF(AND(Consortium!I14=Consortium!$I$2+1,Overview!$B$9=2),\"Total\",\"\"))","v":""},{"$f":"IF(J14=\"\",\"\",IF(J14=\"Total\",SUM(Consortium!M3:M14),Consortium!M14))","v":""},{"$f":"IF(J14=\"\",\"\",IF(J14=\"Total\",SUM(Consortium!N3:N14),Consortium!N14))","v":""}]
[null,{"$f":"IF(A15=\"\",\"\",IF(A15=\"Total\",\"\",Consortium!C15))","v":""},{"$f":"IF(Consortium!A15<=Consortium!$A$2,\"Subcontractor\",IF(Consortium!A15=Consortium!$A$2+1,\"Total\",\"\"))","v":""},{"$f":"IF(C15=\"\",\"\",IF(C15=\"Total\",SUM(Consortium!E3:E14),Consortium!E15))","v":""},{"$f":"IF(C15=\"\",\"\",IF(C15=\"Total\",SUM(Consortium!F3:F14),Consortium!F15))","v":""},null,null,null,null,{"$f":"IF(Consortium!I15<=Consortium!$I$2,\"Subcontractor\",IF(AND(Consortium!I15=Consortium!$I$2+1,Overview!$B$9=2),\"Total\",\"\"))","v":""},{"$f":"IF(J15=\"\",\"\",IF(J15=\"Total\",SUM(Consortium!M3:M14),Consortium!M15))","v":""},{"$f":"IF(J15=\"\",\"\",IF(J15=\"Total\",SUM(Consortium!N3:N14),Consortium!N15))","v":""}]
[null,{"$f":"IF(A16=\"\",\"\",IF(A16=\"Total\",\"\",Consortium!C16))","v":""}]
[null,{"$f":"IF(A17=\"\",\"\",IF(A17=\"Total\",\"\",Consortium!C17))","v":""}]
[null,{"$f":"IF(A18=\"\",\"\",IF(A18=\"Total\",\"\",Consortium!C18))","v":""}]
[null,{"$f":"IF(A19=\"\",\"\",IF(A19=\"Total\",\"\",Consortium!C19))","v":""}]
[null,{"$f":"IF(A20=\"\",\"\",IF(A20=\"Total\",\"\",Consortium!C20))","v":""}]

{"sheet":"TableBIPRs","index":10,"n_rows":6,"n_cols":10,"rows_kept":6,"cut":false,"hidden":false,"merged":[]}
[]
[null,"Exact Name of BIPR Item","Owner","Description","Patent # or Ref. / Issue / Revision / Version #","Contract / Funding Details under which the IPR was created","Date of creation of the version of the BIPR listed here","Type of License","Affected deliverables with comments","Protected Format (Y/N)"]
[{"$f":"IF(BIPRs!B5=\"\",0,1)","v":1},{"$f":"IF(BIPRs!B5=\"\",\"\",BIPRs!B5)","v":"My Awesome BIPR Item"},{"$f":"IF(BIPRs!C5=\"\",\"\",BIPRs!C5)","v":""},{"$f":"IF(BIPRs!D5=\"\",\"\",BIPRs!D5)","v":""},{"$f":"IF(BIPRs!E5=\"\",\"\",BIPRs!E5)","v":""},{"$f":"IF(BIPRs!F5=\"\",\"\",BIPRs!F5)","v":""},{"$f":"IF(BIPRs!G5=\"\",\"\",BIPRs!G5)","v":""},{"$f":"IF(BIPRs!H5=\"\",\"\",BIPRs!H5)","v":""},{"$f":"IF(BIPRs!I5=\"\",\"\",BIPRs!I5)","v":""},{"$f":"IF(BIPRs!J5=\"\",\"\",BIPRs!J5)","v":""}]
[{"$f":"IF(BIPRs!B6=\"\",0,1)","v":0},{"$f":"IF(BIPRs!B6=\"\",\"\",BIPRs!B6)","v":""},{"$f":"IF(BIPRs!C6=\"\",\"\",BIPRs!C6)","v":""},{"$f":"IF(BIPRs!D6=\"\",\"\",BIPRs!D6)","v":""},{"$f":"IF(BIPRs!E6=\"\",\"\",BIPRs!E6)","v":""},{"$f":"IF(BIPRs!F6=\"\",\"\",BIPRs!F6)","v":""},{"$f":"IF(BIPRs!G6=\"\",\"\",BIPRs!G6)","v":""},{"$f":"IF(BIPRs!H6=\"\",\"\",BIPRs!H6)","v":""},{"$f":"IF(BIPRs!I6=\"\",\"\",BIPRs!I6)","v":""},{"$f":"IF(BIPRs!J6=\"\",\"\",BIPRs!J6)","v":""}]
[{"$f":"IF(BIPRs!B7=\"\",0,1)","v":0},{"$f":"IF(BIPRs!B7=\"\",\"\",BIPRs!B7)","v":""},{"$f":"IF(BIPRs!C7=\"\",\"\",BIPRs!C7)","v":""},{"$f":"IF(BIPRs!D7=\"\",\"\",BIPRs!D7)","v":""},{"$f":"IF(BIPRs!E7=\"\",\"\",BIPRs!E7)","v":""},{"$f":"IF(BIPRs!F7=\"\",\"\",BIPRs!F7)","v":""},{"$f":"IF(BIPRs!G7=\"\",\"\",BIPRs!G7)","v":""},{"$f":"IF(BIPRs!H7=\"\",\"\",BIPRs!H7)","v":""},{"$f":"IF(BIPRs!I7=\"\",\"\",BIPRs!I7)","v":""},{"$f":"IF(BIPRs!J7=\"\",\"\",BIPRs!J7)","v":""}]
[{"$f":"IF(BIPRs!B8=\"\",0,1)","v":0},{"$f":"IF(BIPRs!B8=\"\",\"\",BIPRs!B8)","v":""},{"$f":"IF(BIPRs!C8=\"\",\"\",BIPRs!C8)","v":""},{"$f":"IF(BIPRs!D8=\"\",\"\",BIPRs!D8)","v":""},{"$f":"IF(BIPRs!E8=\"\",\"\",BIPRs!E8)","v":""},{"$f":"IF(BIPRs!F8=\"\",\"\",BIPRs!F8)","v":""},{"$f":"IF(BIPRs!G8=\"\",\"\",BIPRs!G8)","v":""},{"$f":"IF(BIPRs!H8=\"\",\"\",BIPRs!H8)","v":""},{"$f":"IF(BIPRs!I8=\"\",\"\",BIPRs!I8)","v":""},{"$f":"IF(BIPRs!J8=\"\",\"\",BIPRs!J8)","v":""}]

{"sheet":"TableMilestones","index":11,"n_rows":11,"n_cols":9,"rows_kept":11,"cut":false,"hidden":false,"merged":[]}
["Phase 1",null,null,null,null,"Phase 2"]
["Milestone (MS) Description","Schedule Date","Payments from ESA to Prime \nContractor (in Euro)","Country \n(ISO code)",null,"Milestone (MS) Description","Schedule Date","Payments from ESA to Prime \nContractor (in Euro)","Country \n(ISO code)"]
[{"$f":"IF(MPP!A5<=MPP!$A$4,MPP!B5,\"\")","v":"Milestone Description"},{"$f":"IF(MPP!A5<=MPP!$A$4,MPP!C5,IF(MPP!A5=MPP!$A$4+1,\"Total\",\"\"))","v":"2023-07-16"},{"$f":"IF(MPP!A5<=MPP!$A$4,MPP!D5,IF(MPP!A5=MPP!$A$4+1,SUM(MPP!D5:D12),\"\"))","v":225000},{"$f":"IF(MPP!A5<=MPP!$A$4,MPP!E5,\"\")","v":"IT"},null,{"$f":"IF(MPP!A17<=MPP!$A$16,MPP!B17,\"\")","v":"Milestone Description"},{"$f":"IF(MPP!A17<=MPP!$A$16,MPP!C17,IF(MPP!A17=MPP!$A$16+1,\"Total\",\"\"))","v":"2023-10-30"},{"$f":"IF(MPP!A17<=MPP!$A$16,MPP!D17,IF(MPP!A17=MPP!$A$16+1,SUM(MPP!D17:D24),\"\"))","v":200000},{"$f":"IF(MPP!A17<=MPP!$A$16,MPP!E17,\"\")","v":"IT"}]
[{"$f":"IF(MPP!A6<=MPP!$A$4,MPP!B6,\"\")","v":"Milestone Description"},{"$f":"IF(MPP!A6<=MPP!$A$4,MPP!C6,IF(MPP!A6=MPP!$A$4+1,\"Total\",\"\"))","v":"2023-09-30"},{"$f":"IF(MPP!A6<=MPP!$A$4,MPP!D6,IF(MPP!A6=MPP!$A$4+1,SUM(MPP!D5:D12),\"\"))","v":300000},{"$f":"IF(MPP!A6<=MPP!$A$4,MPP!E6,\"\")","v":"IT"},null,{"$f":"IF(MPP!A18<=MPP!$A$16,MPP!B18,\"\")","v":"Milestone Description"},{"$f":"IF(MPP!A18<=MPP!$A$16,MPP!C18,IF(MPP!A18=MPP!$A$16+1,\"Total\",\"\"))","v":"2024-01-30"},{"$f":"IF(MPP!A18<=MPP!$A$16,MPP!D18,IF(MPP!A18=MPP!$A$16+1,SUM(MPP!D17:D24),\"\"))","v":200000},{"$f":"IF(MPP!A18<=MPP!$A$16,MPP!E18,\"\")","v":"IT"}]
[{"$f":"IF(MPP!A7<=MPP!$A$4,MPP!B7,\"\")","v":""},{"$f":"IF(MPP!A7<=MPP!$A$4,MPP!C7,IF(MPP!A7=MPP!$A$4+1,\"Total\",\"\"))","v":"Total"},{"$f":"IF(MPP!A7<=MPP!$A$4,MPP!D7,IF(MPP!A7=MPP!$A$4+1,SUM(MPP!D5:D12),\"\"))","v":525000},{"$f":"IF(MPP!A7<=MPP!$A$4,MPP!E7,\"\")","v":""},null,{"$f":"IF(MPP!A19<=MPP!$A$16,MPP!B19,\"\")","v":"Milestone Description"},{"$f":"IF(MPP!A19<=MPP!$A$16,MPP!C19,IF(MPP!A19=MPP!$A$16+1,\"Total\",\"\"))","v":"2024-06-15"},{"$f":"IF(MPP!A19<=MPP!$A$16,MPP!D19,IF(MPP!A19=MPP!$A$16+1,SUM(MPP!D17:D24),\"\"))","v":150000},{"$f":"IF(MPP!A19<=MPP!$A$16,MPP!E19,\"\")","v":"IT"}]
[{"$f":"IF(MPP!A8<=MPP!$A$4,MPP!B8,\"\")","v":""},{"$f":"IF(MPP!A8<=MPP!$A$4,MPP!C8,IF(MPP!A8=MPP!$A$4+1,\"Total\",\"\"))","v":""},{"$f":"IF(MPP!A8<=MPP!$A$4,MPP!D8,IF(MPP!A8=MPP!$A$4+1,SUM(MPP!D5:D12),\"\"))","v":""},{"$f":"IF(MPP!A8<=MPP!$A$4,MPP!E8,\"\")","v":""},null,{"$f":"IF(MPP!A20<=MPP!$A$16,MPP!B20,\"\")","v":"Milestone Description"},{"$f":"IF(MPP!A20<=MPP!$A$16,MPP!C20,IF(MPP!A20=MPP!$A$16+1,\"Total\",\"\"))","v":"2024-10-15"},{"$f":"IF(MPP!A20<=MPP!$A$16,MPP!D20,IF(MPP!A20=MPP!$A$16+1,SUM(MPP!D17:D24),\"\"))","v":200000},{"$f":"IF(MPP!A20<=MPP!$A$16,MPP!E20,\"\")","v":"IT"}]
[{"$f":"IF(MPP!A9<=MPP!$A$4,MPP!B9,\"\")","v":""},{"$f":"IF(MPP!A9<=MPP!$A$4,MPP!C9,IF(MPP!A9=MPP!$A$4+1,\"Total\",\"\"))","v":""},{"$f":"IF(MPP!A9<=MPP!$A$4,MPP!D9,IF(MPP!A9=MPP!$A$4+1,SUM(MPP!D5:D12),\"\"))","v":""},{"$f":"IF(MPP!A9<=MPP!$A$4,MPP!E9,\"\")","v":""},null,{"$f":"IF(MPP!A21<=MPP!$A$16,MPP!B21,\"\")","v":"Milestone Description"},{"$f":"IF(MPP!A21<=MPP!$A$16,MPP!C21,IF(MPP!A21=MPP!$A$16+1,\"Total\",\"\"))","v":"2025-01-15"},{"$f":"IF(MPP!A21<=MPP!$A$16,MPP!D21,IF(MPP!A21=MPP!$A$16+1,SUM(MPP!D17:D24),\"\"))","v":40000},{"$f":"IF(MPP!A21<=MPP!$A$16,MPP!E21,\"\")","v":"IT"}]
[{"$f":"IF(MPP!A10<=MPP!$A$4,MPP!B10,\"\")","v":""},{"$f":"IF(MPP!A10<=MPP!$A$4,MPP!C10,IF(MPP!A10=MPP!$A$4+1,\"Total\",\"\"))","v":""},{"$f":"IF(MPP!A10<=MPP!$A$4,MPP!D10,IF(MPP!A10=MPP!$A$4+1,SUM(MPP!D5:D12),\"\"))","v":""},{"$f":"IF(MPP!A10<=MPP!$A$4,MPP!E10,\"\")","v":""},null,{"$f":"IF(MPP!A22<=MPP!$A$16,MPP!B22,\"\")","v":""},{"$f":"IF(MPP!A22<=MPP!$A$16,MPP!C22,IF(MPP!A22=MPP!$A$16+1,\"Total\",\"\"))","v":"Total"},{"$f":"IF(MPP!A22<=MPP!$A$16,MPP!D22,IF(MPP!A22=MPP!$A$16+1,SUM(MPP!D17:D24),\"\"))","v":790000},{"$f":"IF(MPP!A22<=MPP!$A$16,MPP!E22,\"\")","v":""}]
[{"$f":"IF(MPP!A11<=MPP!$A$4,MPP!B11,\"\")","v":""},{"$f":"IF(MPP!A11<=MPP!$A$4,MPP!C11,IF(MPP!A11=MPP!$A$4+1,\"Total\",\"\"))","v":""},{"$f":"IF(MPP!A11<=MPP!$A$4,MPP!D11,IF(MPP!A11=MPP!$A$4+1,SUM(MPP!D5:D12),\"\"))","v":""},{"$f":"IF(MPP!A11<=MPP!$A$4,MPP!E11,\"\")","v":""},null,{"$f":"IF(MPP!A23<=MPP!$A$16,MPP!B23,\"\")","v":""},{"$f":"IF(MPP!A23<=MPP!$A$16,MPP!C23,IF(MPP!A23=MPP!$A$16+1,\"Total\",\"\"))","v":""},{"$f":"IF(MPP!A23<=MPP!$A$16,MPP!D23,IF(MPP!A23=MPP!$A$16+1,SUM(MPP!D17:D24),\"\"))","v":""},{"$f":"IF(MPP!A23<=MPP!$A$16,MPP!E23,\"\")","v":""}]
[{"$f":"IF(MPP!A12<=MPP!$A$4,MPP!B12,\"\")","v":""},{"$f":"IF(MPP!A12<=MPP!$A$4,MPP!C12,IF(MPP!A12=MPP!$A$4+1,\"Total\",\"\"))","v":""},{"$f":"IF(MPP!A12<=MPP!$A$4,MPP!D12,IF(MPP!A12=MPP!$A$4+1,SUM(MPP!D5:D12),\"\"))","v":""},{"$f":"IF(MPP!A12<=MPP!$A$4,MPP!E12,\"\")","v":""},null,{"$f":"IF(MPP!A24<=MPP!$A$16,MPP!B24,\"\")","v":""},{"$f":"IF(MPP!A24<=MPP!$A$16,MPP!C24,IF(MPP!A24=MPP!$A$16+1,\"Total\",\"\"))","v":""},{"$f":"IF(MPP!A24<=MPP!$A$16,MPP!D24,IF(MPP!A24=MPP!$A$16+1,SUM(MPP!D17:D24),\"\"))","v":""},{"$f":"IF(MPP!A24<=MPP!$A$16,MPP!E24,\"\")","v":""}]
[null,{"$f":"IF(MPP!A13<=MPP!$A$4,MPP!C13,IF(MPP!A13=MPP!$A$4+1,\"Total\",\"\"))","v":""},{"$f":"IF(MPP!A13<=MPP!$A$4,MPP!D13,IF(MPP!A13=MPP!$A$4+1,SUM(MPP!D5:D12),\"\"))","v":""},null,null,null,{"$f":"IF(MPP!A25<=MPP!$A$16,MPP!C25,IF(MPP!A25=MPP!$A$16+1,\"Total\",\"\"))","v":""},{"$f":"IF(MPP!A25<=MPP!$A$16,MPP!D25,IF(MPP!A25=MPP!$A$16+1,SUM(MPP!D17:D24),\"\"))","v":""}]

{"sheet":"TableBreakdown","index":12,"n_rows":29,"n_cols":13,"rows_kept":29,"cut":false,"hidden":false,"merged":[[0,3,0,6]]}
["Phase 1",null,null,"Scroll down for Phase 2 table"]
["For Information purposes only: "]
["Amounts in Euro for Prime and Subcontractor(s)"]
["Milestone",{"$f":"MPP!C29","v":"Our company\n(IT)"},{"$f":" IF(MPP!D28<=MPP!$C$28,MPP!D29,\"\")","v":"Subco 1\n(AT)"},{"$f":" IF(MPP!E28<=MPP!$C$28,MPP!E29,\"\")","v":""},{"$f":" IF(MPP!F28<=MPP!$C$28,MPP!F29,\"\")","v":""},{"$f":" IF(MPP!G28<=MPP!$C$28,MPP!G29,\"\")","v":""},{"$f":" IF(MPP!H28<=MPP!$C$28,MPP!H29,\"\")","v":""},{"$f":" IF(MPP!I28<=MPP!$C$28,MPP!I29,\"\")","v":""},{"$f":" IF(MPP!J28<=MPP!$C$28,MPP!J29,\"\")","v":""},{"$f":" IF(MPP!K28<=MPP!$C$28,MPP!K29,\"\")","v":""},{"$f":" IF(MPP!L28<=MPP!$C$28,MPP!L29,\"\")","v":""},{"$f":" IF(MPP!M28<=MPP!$C$28,MPP!M29,\"\")","v":""},{"$f":" IF(MPP!N28<=MPP!$C$28,MPP!N29,\"\")","v":""}]
[{"$f":"IF(MPP!A30<=MPP!$A$4,MPP!B30,IF(MPP!A30=MPP!$A$4+1,\"Total\",\"\"))","v":"Milestone Description"},{"$f":"IF(MPP!A30<=MPP!$A$4,MPP!C30,IF(MPP!A30=MPP!$A$4+1,SUM(MPP!C30:C37),\"\"))","v":210000},{"$f":"IF(MPP!A30<=MPP!$A$4,MPP!D30,IF(MPP!A30=MPP!$A$4+1,SUM(MPP!D30:D37),\"\"))","v":15000},{"$f":"IF(MPP!A30<=MPP!$A$4,MPP!E30,IF(MPP!A30=MPP!$A$4+1,SUM(MPP!E30:E37),\"\"))","v":0},{"$f":"IF(MPP!A30<=MPP!$A$4,MPP!F30,IF(MPP!A30=MPP!$A$4+1,SUM(MPP!F30:F37),\"\"))","v":0},{"$f":"IF(MPP!A30<=MPP!$A$4,MPP!G30,IF(MPP!A30=MPP!$A$4+1,SUM(MPP!G30:G37),\"\"))","v":0},{"$f":"IF(MPP!A30<=MPP!$A$4,MPP!H30,IF(MPP!A30=MPP!$A$4+1,SUM(MPP!H30:H37),\"\"))","v":0},{"$f":"IF(MPP!A30<=MPP!$A$4,MPP!I30,IF(MPP!A30=MPP!$A$4+1,SUM(MPP!I30:I37),\"\"))","v":0},{"$f":"IF(MPP!A30<=MPP!$A$4,MPP!J30,IF(MPP!A30=MPP!$A$4+1,SUM(MPP!J30:J37),\"\"))","v":0},{"$f":"IF(MPP!A30<=MPP!$A$4,MPP!K30,IF(MPP!A30=MPP!$A$4+1,SUM(MPP!K30:K37),\"\"))","v":0},{"$f":"IF(MPP!A30<=MPP!$A$4,MPP!L30,IF(MPP!A30=MPP!$A$4+1,SUM(MPP!L30:L37),\"\"))","v":0},{"$f":"IF(MPP!A30<=MPP!$A$4,MPP!M30,IF(MPP!A30=MPP!$A$4+1,SUM(MPP!M30:M37),\"\"))","v":0},{"$f":"IF(MPP!A30<=MPP!$A$4,MPP!N30,IF(MPP!A30=MPP!$A$4+1,SUM(MPP!N30:N37),\"\"))","v":0}]
[{"$f":"IF(MPP!A31<=MPP!$A$4,MPP!B31,IF(MPP!A31=MPP!$A$4+1,\"Total\",\"\"))","v":"Milestone Description"},{"$f":"IF(MPP!A31<=MPP!$A$4,MPP!C31,IF(MPP!A31=MPP!$A$4+1,SUM(MPP!C30:C37),\"\"))","v":290000},{"$f":"IF(MPP!A31<=MPP!$A$4,MPP!D31,IF(MPP!A31=MPP!$A$4+1,SUM(MPP!D30:DD37),\"\"))","v":10000},{"$f":"IF(MPP!A31<=MPP!$A$4,MPP!E31,IF(MPP!A31=MPP!$A$4+1,SUM(MPP!E30:E37),\"\"))","v":0},{"$f":"IF(MPP!A31<=MPP!$A$4,MPP!F31,IF(MPP!A31=MPP!$A$4+1,SUM(MPP!F30:F37),\"\"))","v":0},{"$f":"IF(MPP!A31<=MPP!$A$4,MPP!G31,IF(MPP!A31=MPP!$A$4+1,SUM(MPP!G30:G37),\"\"))","v":0},{"$f":"IF(MPP!A31<=MPP!$A$4,MPP!H31,IF(MPP!A31=MPP!$A$4+1,SUM(MPP!H30:H37),\"\"))","v":0},{"$f":"IF(MPP!A31<=MPP!$A$4,MPP!I31,IF(MPP!A31=MPP!$A$4+1,SUM(MPP!I30:I37),\"\"))","v":0},{"$f":"IF(MPP!A31<=MPP!$A$4,MPP!J31,IF(MPP!A31=MPP!$A$4+1,SUM(MPP!J30:J37),\"\"))","v":0},{"$f":"IF(MPP!A31<=MPP!$A$4,MPP!K31,IF(MPP!A31=MPP!$A$4+1,SUM(MPP!K30:K37),\"\"))","v":0},{"$f":"IF(MPP!A31<=MPP!$A$4,MPP!L31,IF(MPP!A31=MPP!$A$4+1,SUM(MPP!L30:L37),\"\"))","v":0},{"$f":"IF(MPP!A31<=MPP!$A$4,MPP!M31,IF(MPP!A31=MPP!$A$4+1,SUM(MPP!M30:M37),\"\"))","v":0},{"$f":"IF(MPP!A31<=MPP!$A$4,MPP!N31,IF(MPP!A31=MPP!$A$4+1,SUM(MPP!N30:N37),\"\"))","v":0}]
[{"$f":"IF(MPP!A32<=MPP!$A$4,MPP!B32,IF(MPP!A32=MPP!$A$4+1,\"Total\",\"\"))","v":"Total"},{"$f":"IF(MPP!A32<=MPP!$A$4,MPP!C32,IF(MPP!A32=MPP!$A$4+1,SUM(MPP!C30:C37),\"\"))","v":500000},{"$f":"IF(MPP!A32<=MPP!$A$4,MPP!D32,IF(MPP!A32=MPP!$A$4+1,SUM(MPP!D30:DD37),\"\"))","v":25000},{"$f":"IF(MPP!A32<=MPP!$A$4,MPP!E32,IF(MPP!A32=MPP!$A$4+1,SUM(MPP!E30:E37),\"\"))","v":0},{"$f":"IF(MPP!A32<=MPP!$A$4,MPP!F32,IF(MPP!A32=MPP!$A$4+1,SUM(MPP!F30:F37),\"\"))","v":0},{"$f":"IF(MPP!A32<=MPP!$A$4,MPP!G32,IF(MPP!A32=MPP!$A$4+1,SUM(MPP!G30:G37),\"\"))","v":0},{"$f":"IF(MPP!A32<=MPP!$A$4,MPP!H32,IF(MPP!A32=MPP!$A$4+1,SUM(MPP!H30:H37),\"\"))","v":0},{"$f":"IF(MPP!A32<=MPP!$A$4,MPP!I32,IF(MPP!A32=MPP!$A$4+1,SUM(MPP!I30:I37),\"\"))","v":0},{"$f":"IF(MPP!A32<=MPP!$A$4,MPP!J32,IF(MPP!A32=MPP!$A$4+1,SUM(MPP!J30:J37),\"\"))","v":0},{"$f":"IF(MPP!A32<=MPP!$A$4,MPP!K32,IF(MPP!A32=MPP!$A$4+1,SUM(MPP!K30:K37),\"\"))","v":0},{"$f":"IF(MPP!A32<=MPP!$A$4,MPP!L32,IF(MPP!A32=MPP!$A$4+1,SUM(MPP!L30:L37),\"\"))","v":0},{"$f":"IF(MPP!A32<=MPP!$A$4,MPP!M32,IF(MPP!A32=MPP!$A$4+1,SUM(MPP!M30:M37),\"\"))","v":0},{"$f":"IF(MPP!A32<=MPP!$A$4,MPP!N32,IF(MPP!A32=MPP!$A$4+1,SUM(MPP!N30:N37),\"\"))","v":0}]
[{"$f":"IF(MPP!A33<=MPP!$A$4,MPP!B33,IF(MPP!A33=MPP!$A$4+1,\"Total\",\"\"))","v":""},{"$f":"IF(MPP!A33<=MPP!$A$4,MPP!C33,IF(MPP!A33=MPP!$A$4+1,SUM(MPP!C30:C37),\"\"))","v":""},{"$f":"IF(MPP!A33<=MPP!$A$4,MPP!D33,IF(MPP!A33=MPP!$A$4+1,SUM(MPP!D30:DD37),\"\"))","v":""},{"$f":"IF(MPP!A33<=MPP!$A$4,MPP!E33,IF(MPP!A33=MPP!$A$4+1,SUM(MPP!E30:E37),\"\"))","v":""},{"$f":"IF(MPP!A33<=MPP!$A$4,MPP!F33,IF(MPP!A33=MPP!$A$4+1,SUM(MPP!F30:F37),\"\"))","v":""},{"$f":"IF(MPP!A33<=MPP!$A$4,MPP!G33,IF(MPP!A33=MPP!$A$4+1,SUM(MPP!G30:G37),\"\"))","v":""},{"$f":"IF(MPP!A33<=MPP!$A$4,MPP!H33,IF(MPP!A33=MPP!$A$4+1,SUM(MPP!H30:H37),\"\"))","v":""},{"$f":"IF(MPP!A33<=MPP!$A$4,MPP!I33,IF(MPP!A33=MPP!$A$4+1,SUM(MPP!I30:I37),\"\"))","v":""},{"$f":"IF(MPP!A33<=MPP!$A$4,MPP!J33,IF(MPP!A33=MPP!$A$4+1,SUM(MPP!J30:J37),\"\"))","v":""},{"$f":"IF(MPP!A33<=MPP!$A$4,MPP!K33,IF(MPP!A33=MPP!$A$4+1,SUM(MPP!K30:K37),\"\"))","v":""},{"$f":"IF(MPP!A33<=MPP!$A$4,MPP!L33,IF(MPP!A33=MPP!$A$4+1,SUM(MPP!L30:L37),\"\"))","v":""},{"$f":"IF(MPP!A33<=MPP!$A$4,MPP!M33,IF(MPP!A33=MPP!$A$4+1,SUM(MPP!M30:M37),\"\"))","v":""},{"$f":"IF(MPP!A33<=MPP!$A$4,MPP!N33,IF(MPP!A33=MPP!$A$4+1,SUM(MPP!N30:N37),\"\"))","v":""}]
[{"$f":"IF(MPP!A34<=MPP!$A$4,MPP!B34,IF(MPP!A34=MPP!$A$4+1,\"Total\",\"\"))","v":""},{"$f":"IF(MPP!A34<=MPP!$A$4,MPP!C34,IF(MPP!A34=MPP!$A$4+1,SUM(MPP!C30:C37),\"\"))","v":""},{"$f":"IF(MPP!A34<=MPP!$A$4,MPP!D34,IF(MPP!A34=MPP!$A$4+1,SUM(MPP!D30:D37),\"\"))","v":""},{"$f":"IF(MPP!A34<=MPP!$A$4,MPP!E34,IF(MPP!A34=MPP!$A$4+1,SUM(MPP!E30:E37),\"\"))","v":""},{"$f":"IF(MPP!A34<=MPP!$A$4,MPP!F34,IF(MPP!A34=MPP!$A$4+1,SUM(MPP!F30:F37),\"\"))","v":""},{"$f":"IF(MPP!A34<=MPP!$A$4,MPP!G34,IF(MPP!A34=MPP!$A$4+1,SUM(MPP!G30:G37),\"\"))","v":""},{"$f":"IF(MPP!A34<=MPP!$A$4,MPP!H34,IF(MPP!A34=MPP!$A$4+1,SUM(MPP!H30:H37),\"\"))","v":""},{"$f":"IF(MPP!A34<=MPP!$A$4,MPP!I34,IF(MPP!A34=MPP!$A$4+1,SUM(MPP!I30:I37),\"\"))","v":""},{"$f":"IF(MPP!A34<=MPP!$A$4,MPP!J34,IF(MPP!A34=MPP!$A$4+1,SUM(MPP!J30:J37),\"\"))","v":""},{"$f":"IF(MPP!A34<=MPP!$A$4,MPP!K34,IF(MPP!A34=MPP!$A$4+1,SUM(MPP!K30:K37),\"\"))","v":""},{"$f":"IF(MPP!A34<=MPP!$A$4,MPP!L34,IF(MPP!A34=MPP!$A$4+1,SUM(MPP!L30:L37),\"\"))","v":""},{"$f":"IF(MPP!A34<=MPP!$A$4,MPP!M34,IF(MPP!A34=MPP!$A$4+1,SUM(MPP!M30:M37),\"\"))","v":""},{"$f":"IF(MPP!A34<=MPP!$A$4,MPP!N34,IF(MPP!A34=MPP!$A$4+1,SUM(MPP!N30:N37),\"\"))","v":""}]
[{"$f":"IF(MPP!A35<=MPP!$A$4,MPP!B35,IF(MPP!A35=MPP!$A$4+1,\"Total\",\"\"))","v":""},{"$f":"IF(MPP!A35<=MPP!$A$4,MPP!C35,IF(MPP!A35=MPP!$A$4+1,SUM(MPP!C30:C37),\"\"))","v":""},{"$f":"IF(MPP!A35<=MPP!$A$4,MPP!D35,IF(MPP!A35=MPP!$A$4+1,SUM(MPP!D30:D37),\"\"))","v":""},{"$f":"IF(MPP!A35<=MPP!$A$4,MPP!E35,IF(MPP!A35=MPP!$A$4+1,SUM(MPP!E30:E37),\"\"))","v":""},{"$f":"IF(MPP!A35<=MPP!$A$4,MPP!F35,IF(MPP!A35=MPP!$A$4+1,SUM(MPP!F30:F37),\"\"))","v":""},{"$f":"IF(MPP!A35<=MPP!$A$4,MPP!G35,IF(MPP!A35=MPP!$A$4+1,SUM(MPP!G30:G37),\"\"))","v":""},{"$f":"IF(MPP!A35<=MPP!$A$4,MPP!H35,IF(MPP!A35=MPP!$A$4+1,SUM(MPP!H30:H37),\"\"))","v":""},{"$f":"IF(MPP!A35<=MPP!$A$4,MPP!I35,IF(MPP!A35=MPP!$A$4+1,SUM(MPP!I30:I37),\"\"))","v":""},{"$f":"IF(MPP!A35<=MPP!$A$4,MPP!J35,IF(MPP!A35=MPP!$A$4+1,SUM(MPP!J30:J37),\"\"))","v":""},{"$f":"IF(MPP!A35<=MPP!$A$4,MPP!K35,IF(MPP!A35=MPP!$A$4+1,SUM(MPP!K30:K37),\"\"))","v":""},{"$f":"IF(MPP!A35<=MPP!$A$4,MPP!L35,IF(MPP!A35=MPP!$A$4+1,SUM(MPP!L30:L37),\"\"))","v":""},{"$f":"IF(MPP!A35<=MPP!$A$4,MPP!M35,IF(MPP!A35=MPP!$A$4+1,SUM(MPP!M30:M37),\"\"))","v":""},{"$f":"IF(MPP!A35<=MPP!$A$4,MPP!N35,IF(MPP!A35=MPP!$A$4+1,SUM(MPP!N30:N37),\"\"))","v":""}]
[{"$f":"IF(MPP!A36<=MPP!$A$4,MPP!B36,IF(MPP!A36=MPP!$A$4+1,\"Total\",\"\"))","v":""},{"$f":"IF(MPP!A36<=MPP!$A$4,MPP!C36,IF(MPP!A36=MPP!$A$4+1,SUM(MPP!C30:C37),\"\"))","v":""},{"$f":"IF(MPP!A36<=MPP!$A$4,MPP!D36,IF(MPP!A36=MPP!$A$4+1,SUM(MPP!D30:D37),\"\"))","v":""},{"$f":"IF(MPP!A36<=MPP!$A$4,MPP!E36,IF(MPP!A36=MPP!$A$4+1,SUM(MPP!E30:E37),\"\"))","v":""},{"$f":"IF(MPP!A36<=MPP!$A$4,MPP!F36,IF(MPP!A36=MPP!$A$4+1,SUM(MPP!F30:F37),\"\"))","v":""},{"$f":"IF(MPP!A36<=MPP!$A$4,MPP!G36,IF(MPP!A36=MPP!$A$4+1,SUM(MPP!G30:G37),\"\"))","v":""},{"$f":"IF(MPP!A36<=MPP!$A$4,MPP!H36,IF(MPP!A36=MPP!$A$4+1,SUM(MPP!H30:H37),\"\"))","v":""},{"$f":"IF(MPP!A36<=MPP!$A$4,MPP!I36,IF(MPP!A36=MPP!$A$4+1,SUM(MPP!I30:I37),\"\"))","v":""},{"$f":"IF(MPP!A36<=MPP!$A$4,MPP!J36,IF(MPP!A36=MPP!$A$4+1,SUM(MPP!J30:J37),\"\"))","v":""},{"$f":"IF(MPP!A36<=MPP!$A$4,MPP!K36,IF(MPP!A36=MPP!$A$4+1,SUM(MPP!K30:K37),\"\"))","v":""},{"$f":"IF(MPP!A36<=MPP!$A$4,MPP!L36,IF(MPP!A36=MPP!$A$4+1,SUM(MPP!L30:L37),\"\"))","v":""},{"$f":"IF(MPP!A36<=MPP!$A$4,MPP!M36,IF(MPP!A36=MPP!$A$4+1,SUM(MPP!M30:M37),\"\"))","v":""},{"$f":"IF(MPP!A36<=MPP!$A$4,MPP!N36,IF(MPP!A36=MPP!$A$4+1,SUM(MPP!N30:N37),\"\"))","v":""}]
[{"$f":"IF(MPP!A37<=MPP!$A$4,MPP!B37,IF(MPP!A37=MPP!$A$4+1,\"Total\",\"\"))","v":""},{"$f":"IF(MPP!A37<=MPP!$A$4,MPP!C37,IF(MPP!A37=MPP!$A$4+1,SUM(MPP!C30:C37),\"\"))","v":""},{"$f":"IF(MPP!A37<=MPP!$A$4,MPP!D37,IF(MPP!A37=MPP!$A$4+1,SUM(MPP!D30:D37),\"\"))","v":""},{"$f":"IF(MPP!A37<=MPP!$A$4,MPP!E37,IF(MPP!A37=MPP!$A$4+1,SUM(MPP!E30:E37),\"\"))","v":""},{"$f":"IF(MPP!A37<=MPP!$A$4,MPP!F37,IF(MPP!A37=MPP!$A$4+1,SUM(MPP!F30:F37),\"\"))","v":""},{"$f":"IF(MPP!A37<=MPP!$A$4,MPP!G37,IF(MPP!A37=MPP!$A$4+1,SUM(MPP!G30:G37),\"\"))","v":""},{"$f":"IF(MPP!A37<=MPP!$A$4,MPP!H37,IF(MPP!A37=MPP!$A$4+1,SUM(MPP!H30:H37),\"\"))","v":""},{"$f":"IF(MPP!A37<=MPP!$A$4,MPP!I37,IF(MPP!A37=MPP!$A$4+1,SUM(MPP!I30:I37),\"\"))","v":""},{"$f":"IF(MPP!A37<=MPP!$A$4,MPP!J37,IF(MPP!A37=MPP!$A$4+1,SUM(MPP!J30:J37),\"\"))","v":""},{"$f":"IF(MPP!A37<=MPP!$A$4,MPP!K37,IF(MPP!A37=MPP!$A$4+1,SUM(MPP!K30:K37),\"\"))","v":""},{"$f":"IF(MPP!A37<=MPP!$A$4,MPP!L37,IF(MPP!A37=MPP!$A$4+1,SUM(MPP!L30:L37),\"\"))","v":""},{"$f":"IF(MPP!A37<=MPP!$A$4,MPP!M37,IF(MPP!A37=MPP!$A$4+1,SUM(MPP!M30:M37),\"\"))","v":""},{"$f":"IF(MPP!A37<=MPP!$A$4,MPP!N37,IF(MPP!A37=MPP!$A$4+1,SUM(MPP!N30:N37),\"\"))","v":""}]
[{"$f":"IF(MPP!A38<=MPP!$A$4,MPP!B38,IF(MPP!A38=MPP!$A$4+1,\"Total\",\"\"))","v":""},{"$f":"IF(MPP!A38<=MPP!$A$4,MPP!C38,IF(MPP!A38=MPP!$A$4+1,SUM(MPP!C30:C37),\"\"))","v":""},{"$f":"IF(MPP!A38<=MPP!$A$4,MPP!D38,IF(MPP!A38=MPP!$A$4+1,SUM(MPP!D30:D37),\"\"))","v":""},{"$f":"IF(MPP!A38<=MPP!$A$4,MPP!E38,IF(MPP!A38=MPP!$A$4+1,SUM(MPP!E30:E37),\"\"))","v":""},{"$f":"IF(MPP!A38<=MPP!$A$4,MPP!F38,IF(MPP!A38=MPP!$A$4+1,SUM(MPP!F30:F37),\"\"))","v":""},{"$f":"IF(MPP!A38<=MPP!$A$4,MPP!G38,IF(MPP!A38=MPP!$A$4+1,SUM(MPP!G30:G37),\"\"))","v":""},{"$f":"IF(MPP!A38<=MPP!$A$4,MPP!H38,IF(MPP!A38=MPP!$A$4+1,SUM(MPP!H30:H37),\"\"))","v":""},{"$f":"IF(MPP!A38<=MPP!$A$4,MPP!I38,IF(MPP!A38=MPP!$A$4+1,SUM(MPP!I30:I37),\"\"))","v":""},{"$f":"IF(MPP!A38<=MPP!$A$4,MPP!J38,IF(MPP!A38=MPP!$A$4+1,SUM(MPP!J30:J37),\"\"))","v":""},{"$f":"IF(MPP!A38<=MPP!$A$4,MPP!K38,IF(MPP!A38=MPP!$A$4+1,SUM(MPP!K30:K37),\"\"))","v":""},{"$f":"IF(MPP!A38<=MPP!$A$4,MPP!L38,IF(MPP!A38=MPP!$A$4+1,SUM(MPP!L30:L37),\"\"))","v":""},{"$f":"IF(MPP!A38<=MPP!$A$4,MPP!M38,IF(MPP!A38=MPP!$A$4+1,SUM(MPP!M30:M37),\"\"))","v":""},{"$f":"IF(MPP!A38<=MPP!$A$4,MPP!N38,IF(MPP!A38=MPP!$A$4+1,SUM(MPP!N30:N37),\"\"))","v":""}]
[]
[]
[]
["Phase 2"]
["For Information purposes only: "]
["Amounts in Euro for Prime and Subcontractor(s)"]
["Milestone",{"$f":"MPP!C29","v":"Our company\n(IT)"},{"$f":" IF(MPP!D41<=MPP!$C$41,MPP!D42,\"\")","v":"Subco 1\n(AT)"},{"$f":" IF(MPP!E41<=MPP!$C$41,MPP!E42,\"\")","v":"Subco 2\n(DE)"},{"$f":" IF(MPP!F41<=MPP!$C$41,MPP!F42,\"\")","v":""},{"$f":" IF(MPP!G41<=MPP!$C$41,MPP!G42,\"\")","v":""},{"$f":" IF(MPP!H41<=MPP!$C$41,MPP!H42,\"\")","v":""},{"$f":" IF(MPP!I41<=MPP!$C$41,MPP!I42,\"\")","v":""},{"$f":" IF(MPP!J41<=MPP!$C$41,MPP!J42,\"\")","v":""},{"$f":" IF(MPP!K41<=MPP!$C$41,MPP!K42,\"\")","v":""},{"$f":" IF(MPP!L41<=MPP!$C$41,MPP!L42,\"\")","v":""},{"$f":" IF(MPP!M41<=MPP!$C$41,MPP!M42,\"\")","v":""},{"$f":" IF(MPP!N41<=MPP!$C$41,MPP!N42,\"\")","v":""}]
[{"$f":"IF(MPP!A43<=MPP!$A$16,MPP!B43,IF(MPP!A43=MPP!$A$16+1,\"Total\",\"\"))","v":"Milestone Description"},{"$f":"IF(MPP!A43<=MPP!$A$16,MPP!C43,IF(MPP!A43=MPP!$A$16+1,SUM(MPP!C43:C50),\"\"))","v":140000},{"$f":"IF(MPP!A43<=MPP!$A$16,MPP!D43,IF(MPP!A43=MPP!$A$16+1,SUM(MPP!D43:D50),\"\"))","v":40000},{"$f":"IF(MPP!A43<=MPP!$A$16,MPP!E43,IF(MPP!A43=MPP!$A$16+1,SUM(MPP!E43:E50),\"\"))","v":20000},{"$f":"IF(MPP!A43<=MPP!$A$16,MPP!F43,IF(MPP!A43=MPP!$A$16+1,SUM(MPP!F43:F50),\"\"))","v":0},{"$f":"IF(MPP!A43<=MPP!$A$16,MPP!G43,IF(MPP!A43=MPP!$A$16+1,SUM(MPP!G43:G50),\"\"))","v":0},{"$f":"IF(MPP!A43<=MPP!$A$16,MPP!H43,IF(MPP!A43=MPP!$A$16+1,SUM(MPP!H43:H50),\"\"))","v":0},{"$f":"IF(MPP!A43<=MPP!$A$16,MPP!I43,IF(MPP!A43=MPP!$A$16+1,SUM(MPP!I43:I50),\"\"))","v":0},{"$f":"IF(MPP!A43<=MPP!$A$16,MPP!J43,IF(MPP!A43=MPP!$A$16+1,SUM(MPP!J43:J50),\"\"))","v":0},{"$f":"IF(MPP!A43<=MPP!$A$16,MPP!K43,IF(MPP!A43=MPP!$A$16+1,SUM(MPP!K43:K50),\"\"))","v":0},{"$f":"IF(MPP!A43<=MPP!$A$16,MPP!L43,IF(MPP!A43=MPP!$A$16+1,SUM(MPP!L43:L50),\"\"))","v":0},{"$f":"IF(MPP!A43<=MPP!$A$16,MPP!M43,IF(MPP!A43=MPP!$A$16+1,SUM(MPP!M43:M50),\"\"))","v":0},{"$f":"IF(MPP!A43<=MPP!$A$16,MPP!N43,IF(MPP!A43=MPP!$A$16+1,SUM(MPP!N43:N50),\"\"))","v":0}]
[{"$f":"IF(MPP!A44<=MPP!$A$16,MPP!B44,IF(MPP!A44=MPP!$A$16+1,\"Total\",\"\"))","v":"Milestone Description"},{"$f":"IF(MPP!A44<=MPP!$A$16,MPP!C44,IF(MPP!A44=MPP!$A$16+1,SUM(MPP!C43:C50),\"\"))","v":160000},{"$f":"IF(MPP!A44<=MPP!$A$16,MPP!D44,IF(MPP!A44=MPP!$A$16+1,SUM(MPP!D43:D50),\"\"))","v":20000},{"$f":"IF(MPP!A44<=MPP!$A$16,MPP!E44,IF(MPP!A44=MPP!$A$16+1,SUM(MPP!E43:E50),\"\"))","v":20000},{"$f":"IF(MPP!A44<=MPP!$A$16,MPP!F44,IF(MPP!A44=MPP!$A$16+1,SUM(MPP!F43:F50),\"\"))","v":0},{"$f":"IF(MPP!A44<=MPP!$A$16,MPP!G44,IF(MPP!A44=MPP!$A$16+1,SUM(MPP!G43:G50),\"\"))","v":0},{"$f":"IF(MPP!A44<=MPP!$A$16,MPP!H44,IF(MPP!A44=MPP!$A$16+1,SUM(MPP!H43:H50),\"\"))","v":0},{"$f":"IF(MPP!A44<=MPP!$A$16,MPP!I44,IF(MPP!A44=MPP!$A$16+1,SUM(MPP!I43:I50),\"\"))","v":0},{"$f":"IF(MPP!A44<=MPP!$A$16,MPP!J44,IF(MPP!A44=MPP!$A$16+1,SUM(MPP!J43:J50),\"\"))","v":0},{"$f":"IF(MPP!A44<=MPP!$A$16,MPP!K44,IF(MPP!A44=MPP!$A$16+1,SUM(MPP!K43:K50),\"\"))","v":0},{"$f":"IF(MPP!A44<=MPP!$A$16,MPP!L44,IF(MPP!A44=MPP!$A$16+1,SUM(MPP!L43:L50),\"\"))","v":0},{"$f":"IF(MPP!A44<=MPP!$A$16,MPP!M44,IF(MPP!A44=MPP!$A$16+1,SUM(MPP!M43:M50),\"\"))","v":0},{"$f":"IF(MPP!A44<=MPP!$A$16,MPP!N44,IF(MPP!A44=MPP!$A$16+1,SUM(MPP!N43:N50),\"\"))","v":0}]
[{"$f":"IF(MPP!A45<=MPP!$A$16,MPP!B45,IF(MPP!A45=MPP!$A$16+1,\"Total\",\"\"))","v":"Milestone Description"},{"$f":"IF(MPP!A45<=MPP!$A$16,MPP!C45,IF(MPP!A45=MPP!$A$16+1,SUM(MPP!C43:C50),\"\"))","v":110000},{"$f":"IF(MPP!A45<=MPP!$A$16,MPP!D45,IF(MPP!A45=MPP!$A$16+1,SUM(MPP!D43:D50),\"\"))","v":20000},{"$f":"IF(MPP!A45<=MPP!$A$16,MPP!E45,IF(MPP!A45=MPP!$A$16+1,SUM(MPP!E43:E50),\"\"))","v":20000},{"$f":"IF(MPP!A45<=MPP!$A$16,MPP!F45,IF(MPP!A45=MPP!$A$16+1,SUM(MPP!F43:F50),\"\"))","v":0},{"$f":"IF(MPP!A45<=MPP!$A$16,MPP!G45,IF(MPP!A45=MPP!$A$16+1,SUM(MPP!G43:G50),\"\"))","v":0},{"$f":"IF(MPP!A45<=MPP!$A$16,MPP!H45,IF(MPP!A45=MPP!$A$16+1,SUM(MPP!H43:H50),\"\"))","v":0},{"$f":"IF(MPP!A45<=MPP!$A$16,MPP!I45,IF(MPP!A45=MPP!$A$16+1,SUM(MPP!I43:I50),\"\"))","v":0},{"$f":"IF(MPP!A45<=MPP!$A$16,MPP!J45,IF(MPP!A45=MPP!$A$16+1,SUM(MPP!J43:J50),\"\"))","v":0},{"$f":"IF(MPP!A45<=MPP!$A$16,MPP!K45,IF(MPP!A45=MPP!$A$16+1,SUM(MPP!K43:K50),\"\"))","v":0},{"$f":"IF(MPP!A45<=MPP!$A$16,MPP!L45,IF(MPP!A45=MPP!$A$16+1,SUM(MPP!L43:L50),\"\"))","v":0},{"$f":"IF(MPP!A45<=MPP!$A$16,MPP!M45,IF(MPP!A45=MPP!$A$16+1,SUM(MPP!M43:M50),\"\"))","v":0},{"$f":"IF(MPP!A45<=MPP!$A$16,MPP!N45,IF(MPP!A45=MPP!$A$16+1,SUM(MPP!N43:N50),\"\"))","v":0}]
[{"$f":"IF(MPP!A46<=MPP!$A$16,MPP!B46,IF(MPP!A46=MPP!$A$16+1,\"Total\",\"\"))","v":"Milestone Description"},{"$f":"IF(MPP!A46<=MPP!$A$16,MPP!C46,IF(MPP!A46=MPP!$A$16+1,SUM(MPP!C43:C50),\"\"))","v":170000},{"$f":"IF(MPP!A46<=MPP!$A$16,MPP!D46,IF(MPP!A46=MPP!$A$16+1,SUM(MPP!D43:D50),\"\"))","v":10000},{"$f":"IF(MPP!A46<=MPP!$A$16,MPP!E46,IF(MPP!A46=MPP!$A$16+1,SUM(MPP!E43:E50),\"\"))","v":20000},{"$f":"IF(MPP!A46<=MPP!$A$16,MPP!F46,IF(MPP!A46=MPP!$A$16+1,SUM(MPP!F43:F50),\"\"))","v":0},{"$f":"IF(MPP!A46<=MPP!$A$16,MPP!G46,IF(MPP!A46=MPP!$A$16+1,SUM(MPP!G43:G50),\"\"))","v":0},{"$f":"IF(MPP!A46<=MPP!$A$16,MPP!H46,IF(MPP!A46=MPP!$A$16+1,SUM(MPP!H43:H50),\"\"))","v":0},{"$f":"IF(MPP!A46<=MPP!$A$16,MPP!I46,IF(MPP!A46=MPP!$A$16+1,SUM(MPP!I43:I50),\"\"))","v":0},{"$f":"IF(MPP!A46<=MPP!$A$16,MPP!J46,IF(MPP!A46=MPP!$A$16+1,SUM(MPP!J43:J50),\"\"))","v":0},{"$f":"IF(MPP!A46<=MPP!$A$16,MPP!K46,IF(MPP!A46=MPP!$A$16+1,SUM(MPP!K43:K50),\"\"))","v":0},{"$f":"IF(MPP!A46<=MPP!$A$16,MPP!L46,IF(MPP!A46=MPP!$A$16+1,SUM(MPP!L43:L50),\"\"))","v":0},{"$f":"IF(MPP!A46<=MPP!$A$16,MPP!M46,IF(MPP!A46=MPP!$A$16+1,SUM(MPP!M43:M50),\"\"))","v":0},{"$f":"IF(MPP!A46<=MPP!$A$16,MPP!N46,IF(MPP!A46=MPP!$A$16+1,SUM(MPP!N43:N50),\"\"))","v":0}]
[{"$f":"IF(MPP!A47<=MPP!$A$16,MPP!B47,IF(MPP!A47=MPP!$A$16+1,\"Total\",\"\"))","v":"Milestone Description"},{"$f":"IF(MPP!A47<=MPP!$A$16,MPP!C47,IF(MPP!A47=MPP!$A$16+1,SUM(MPP!C43:C50),\"\"))","v":20000},{"$f":"IF(MPP!A47<=MPP!$A$16,MPP!D47,IF(MPP!A47=MPP!$A$16+1,SUM(MPP!D43:D50),\"\"))","v":10000},{"$f":"IF(MPP!A47<=MPP!$A$16,MPP!E47,IF(MPP!A47=MPP!$A$16+1,SUM(MPP!E43:E50),\"\"))","v":10000},{"$f":"IF(MPP!A47<=MPP!$A$16,MPP!F47,IF(MPP!A47=MPP!$A$16+1,SUM(MPP!F43:F50),\"\"))","v":0},{"$f":"IF(MPP!A47<=MPP!$A$16,MPP!G47,IF(MPP!A47=MPP!$A$16+1,SUM(MPP!G43:G50),\"\"))","v":0},{"$f":"IF(MPP!A47<=MPP!$A$16,MPP!H47,IF(MPP!A47=MPP!$A$16+1,SUM(MPP!H43:H50),\"\"))","v":0},{"$f":"IF(MPP!A47<=MPP!$A$16,MPP!I47,IF(MPP!A47=MPP!$A$16+1,SUM(MPP!I43:I50),\"\"))","v":0},{"$f":"IF(MPP!A47<=MPP!$A$16,MPP!J47,IF(MPP!A47=MPP!$A$16+1,SUM(MPP!J43:J50),\"\"))","v":0},{"$f":"IF(MPP!A47<=MPP!$A$16,MPP!K47,IF(MPP!A47=MPP!$A$16+1,SUM(MPP!K43:K50),\"\"))","v":0},{"$f":"IF(MPP!A47<=MPP!$A$16,MPP!L47,IF(MPP!A47=MPP!$A$16+1,SUM(MPP!L43:L50),\"\"))","v":0},{"$f":"IF(MPP!A47<=MPP!$A$16,MPP!M47,IF(MPP!A47=MPP!$A$16+1,SUM(MPP!M43:M50),\"\"))","v":0},{"$f":"IF(MPP!A47<=MPP!$A$16,MPP!N47,IF(MPP!A47=MPP!$A$16+1,SUM(MPP!N43:N50),\"\"))","v":0}]
[{"$f":"IF(MPP!A48<=MPP!$A$16,MPP!B48,IF(MPP!A48=MPP!$A$16+1,\"Total\",\"\"))","v":"Total"},{"$f":"IF(MPP!A48<=MPP!$A$16,MPP!C48,IF(MPP!A48=MPP!$A$16+1,SUM(MPP!C43:CC50),\"\"))","v":790000},{"$f":"IF(MPP!A48<=MPP!$A$16,MPP!D48,IF(MPP!A48=MPP!$A$16+1,SUM(MPP!D43:D50),\"\"))","v":100000},{"$f":"IF(MPP!A48<=MPP!$A$16,MPP!E48,IF(MPP!A48=MPP!$A$16+1,SUM(MPP!E43:E50),\"\"))","v":90000},{"$f":"IF(MPP!A48<=MPP!$A$16,MPP!F48,IF(MPP!A48=MPP!$A$16+1,SUM(MPP!F43:F50),\"\"))","v":0},{"$f":"IF(MPP!A48<=MPP!$A$16,MPP!G48,IF(MPP!A48=MPP!$A$16+1,SUM(MPP!G43:G50),\"\"))","v":0},{"$f":"IF(MPP!A48<=MPP!$A$16,MPP!H48,IF(MPP!A48=MPP!$A$16+1,SUM(MPP!H43:H50),\"\"))","v":0},{"$f":"IF(MPP!A48<=MPP!$A$16,MPP!I48,IF(MPP!A48=MPP!$A$16+1,SUM(MPP!I43:I50),\"\"))","v":0},{"$f":"IF(MPP!A48<=MPP!$A$16,MPP!J48,IF(MPP!A48=MPP!$A$16+1,SUM(MPP!J43:J50),\"\"))","v":0},{"$f":"IF(MPP!A48<=MPP!$A$16,MPP!K48,IF(MPP!A48=MPP!$A$16+1,SUM(MPP!K43:K50),\"\"))","v":0},{"$f":"IF(MPP!A48<=MPP!$A$16,MPP!L48,IF(MPP!A48=MPP!$A$16+1,SUM(MPP!L43:L50),\"\"))","v":0},{"$f":"IF(MPP!A48<=MPP!$A$16,MPP!M48,IF(MPP!A48=MPP!$A$16+1,SUM(MPP!M43:M50),\"\"))","v":0},{"$f":"IF(MPP!A48<=MPP!$A$16,MPP!N48,IF(MPP!A48=MPP!$A$16+1,SUM(MPP!N43:N50),\"\"))","v":0}]
[{"$f":"IF(MPP!A49<=MPP!$A$16,MPP!B49,IF(MPP!A49=MPP!$A$16+1,\"Total\",\"\"))","v":""},{"$f":"IF(MPP!A49<=MPP!$A$16,MPP!C49,IF(MPP!A49=MPP!$A$16+1,SUM(MPP!C43:CC50),\"\"))","v":""},{"$f":"IF(MPP!A49<=MPP!$A$16,MPP!D49,IF(MPP!A49=MPP!$A$16+1,SUM(MPP!D43:D50),\"\"))","v":""},{"$f":"IF(MPP!A49<=MPP!$A$16,MPP!E49,IF(MPP!A49=MPP!$A$16+1,SUM(MPP!E43:E50),\"\"))","v":""},{"$f":"IF(MPP!A49<=MPP!$A$16,MPP!F49,IF(MPP!A49=MPP!$A$16+1,SUM(MPP!F43:F50),\"\"))","v":""},{"$f":"IF(MPP!A49<=MPP!$A$16,MPP!G49,IF(MPP!A49=MPP!$A$16+1,SUM(MPP!G43:G50),\"\"))","v":""},{"$f":"IF(MPP!A49<=MPP!$A$16,MPP!H49,IF(MPP!A49=MPP!$A$16+1,SUM(MPP!H43:H50),\"\"))","v":""},{"$f":"IF(MPP!A49<=MPP!$A$16,MPP!I49,IF(MPP!A49=MPP!$A$16+1,SUM(MPP!I43:I50),\"\"))","v":""},{"$f":"IF(MPP!A49<=MPP!$A$16,MPP!J49,IF(MPP!A49=MPP!$A$16+1,SUM(MPP!J43:J50),\"\"))","v":""},{"$f":"IF(MPP!A49<=MPP!$A$16,MPP!K49,IF(MPP!A49=MPP!$A$16+1,SUM(MPP!K43:K50),\"\"))","v":""},{"$f":"IF(MPP!A49<=MPP!$A$16,MPP!L49,IF(MPP!A49=MPP!$A$16+1,SUM(MPP!L43:L50),\"\"))","v":""},{"$f":"IF(MPP!A49<=MPP!$A$16,MPP!M49,IF(MPP!A49=MPP!$A$16+1,SUM(MPP!M43:M50),\"\"))","v":""},{"$f":"IF(MPP!A49<=MPP!$A$16,MPP!N49,IF(MPP!A49=MPP!$A$16+1,SUM(MPP!N43:N50),\"\"))","v":""}]
[{"$f":"IF(MPP!A50<=MPP!$A$16,MPP!B50,IF(MPP!A50=MPP!$A$16+1,\"Total\",\"\"))","v":""},{"$f":"IF(MPP!A50<=MPP!$A$16,MPP!C50,IF(MPP!A50=MPP!$A$16+1,SUM(MPP!C43:CC50),\"\"))","v":""},{"$f":"IF(MPP!A50<=MPP!$A$16,MPP!D50,IF(MPP!A50=MPP!$A$16+1,SUM(MPP!D43:D50),\"\"))","v":""},{"$f":"IF(MPP!A50<=MPP!$A$16,MPP!E50,IF(MPP!A50=MPP!$A$16+1,SUM(MPP!E43:E50),\"\"))","v":""},{"$f":"IF(MPP!A50<=MPP!$A$16,MPP!F50,IF(MPP!A50=MPP!$A$16+1,SUM(MPP!F43:F50),\"\"))","v":""},{"$f":"IF(MPP!A50<=MPP!$A$16,MPP!G50,IF(MPP!A50=MPP!$A$16+1,SUM(MPP!G43:G50),\"\"))","v":""},{"$f":"IF(MPP!A50<=MPP!$A$16,MPP!H50,IF(MPP!A50=MPP!$A$16+1,SUM(MPP!H43:H50),\"\"))","v":""},{"$f":"IF(MPP!A50<=MPP!$A$16,MPP!I50,IF(MPP!A50=MPP!$A$16+1,SUM(MPP!I43:I50),\"\"))","v":""},{"$f":"IF(MPP!A50<=MPP!$A$16,MPP!J50,IF(MPP!A50=MPP!$A$16+1,SUM(MPP!J43:J50),\"\"))","v":""},{"$f":"IF(MPP!A50<=MPP!$A$16,MPP!K50,IF(MPP!A50=MPP!$A$16+1,SUM(MPP!K43:K50),\"\"))","v":""},{"$f":"IF(MPP!A50<=MPP!$A$16,MPP!L50,IF(MPP!A50=MPP!$A$16+1,SUM(MPP!L43:L50),\"\"))","v":""},{"$f":"IF(MPP!A50<=MPP!$A$16,MPP!M50,IF(MPP!A50=MPP!$A$16+1,SUM(MPP!M43:M50),\"\"))","v":""},{"$f":"IF(MPP!A50<=MPP!$A$16,MPP!N50,IF(MPP!A50=MPP!$A$16+1,SUM(MPP!N43:N50),\"\"))","v":""}]
[{"$f":"IF(MPP!A51<=MPP!$A$16,MPP!B51,IF(MPP!A51=MPP!$A$16+1,\"Total\",\"\"))","v":""},{"$f":"IF(MPP!A51<=MPP!$A$16,MPP!C51,IF(MPP!A51=MPP!$A$16+1,SUM(MPP!C43:C50),\"\"))","v":""},{"$f":"IF(MPP!A51<=MPP!$A$16,MPP!D51,IF(MPP!A51=MPP!$A$16+1,SUM(MPP!D43:D50),\"\"))","v":""},{"$f":"IF(MPP!A51<=MPP!$A$16,MPP!E51,IF(MPP!A51=MPP!$A$16+1,SUM(MPP!E43:E50),\"\"))","v":""},{"$f":"IF(MPP!A51<=MPP!$A$16,MPP!F51,IF(MPP!A51=MPP!$A$16+1,SUM(MPP!F43:F50),\"\"))","v":""},{"$f":"IF(MPP!A51<=MPP!$A$16,MPP!G51,IF(MPP!A51=MPP!$A$16+1,SUM(MPP!G43:G50),\"\"))","v":""},{"$f":"IF(MPP!A51<=MPP!$A$16,MPP!H51,IF(MPP!A51=MPP!$A$16+1,SUM(MPP!H43:H50),\"\"))","v":""},{"$f":"IF(MPP!A51<=MPP!$A$16,MPP!I51,IF(MPP!A51=MPP!$A$16+1,SUM(MPP!I43:I50),\"\"))","v":""},{"$f":"IF(MPP!A51<=MPP!$A$16,MPP!J51,IF(MPP!A51=MPP!$A$16+1,SUM(MPP!J43:J50),\"\"))","v":""},{"$f":"IF(MPP!A51<=MPP!$A$16,MPP!K51,IF(MPP!A51=MPP!$A$16+1,SUM(MPP!K43:K50),\"\"))","v":""},{"$f":"IF(MPP!A51<=MPP!$A$16,MPP!L51,IF(MPP!A51=MPP!$A$16+1,SUM(MPP!L43:L50),\"\"))","v":""},{"$f":"IF(MPP!A51<=MPP!$A$16,MPP!M51,IF(MPP!A51=MPP!$A$16+1,SUM(MPP!M43:M50),\"\"))","v":""},{"$f":"IF(MPP!A51<=MPP!$A$16,MPP!N51,IF(MPP!A51=MPP!$A$16+1,SUM(MPP!N43:N50),\"\"))","v":""}]

{"sheet":"TableAdvance","index":13,"n_rows":34,"n_cols":10,"rows_kept":34,"cut":false,"hidden":false,"merged":[[0,9,0,12]]}
["Phase 1 - Advance Breakdown",null,null,null,null,null,null,null,null,"Scroll down for Phase 2 table"]
["For Information purposes only: "]
["Amounts in Euro for Contractor and Subcontractor(s)"]
["Prime (P) / Subco (SI)",{"$f":" \"Company\" & CHAR(10) & \"Name\"","v":"Company\nName"},"Vendor Code \n(at contract \nsignature)","Country (ISO code)","Advance Payment (in Euro)","Offset against","Offset by Euro","Condition for release of the Advance Payment (if applicable)"]
[{"$f":"IF(ADV!A3=\"Yes\",ADV!D3,\"\")","v":"P"},{"$f":"IF(A5=\"\",\"\",ADV!E3)","v":"Our Company"},{"$f":"IF(A5=\"\",\"\",ADV!F3)","v":"100 xxx-xxx"},{"$f":"IF(A5=\"\",\"\",ADV!G3)","v":"IT"},{"$f":"IF(A5=\"\",\"\",ADV!H3)","v":50000},{"$f":"IF(A5=\"\",\"\",TRIM(ADV!I3&CHAR(10)&ADV!I4&CHAR(10)&ADV!I5&CHAR(10)&ADV!I6&CHAR(10)&ADV!I7&CHAR(10)&ADV!I8&CHAR(10)&ADV!I9&CHAR(10)&ADV!I10&CHAR(10)))","v":"Milestone 1\nMilestone 2\n\n\n\n\n\n\n"},{"$f":"IF(A5=\"\",\"\",TRIM(ADV!J3&CHAR(10)&ADV!J4&CHAR(10)&ADV!J5&CHAR(10)&ADV!J6&CHAR(10)&ADV!J7&CHAR(10)&ADV!J8&CHAR(10)&ADV!J9&CHAR(10)&ADV!J10&CHAR(10)))","v":"25000\n25000\n\n\n\n\n\n\n"},{"$f":"IF(A5=\"\",\"\",ADV!K3)","v":"After signature of the Contract by both Parties"}]
[{"$f":"IF(ADV!A11=\"Yes\",ADV!D11,\"\")","v":"SI"},{"$f":"IF(A6=\"\",\"\",ADV!E11)","v":"Subco 1"},{"$f":"IF(A6=\"\",\"\",ADV!F11)","v":"100 xxx-xxx"},{"$f":"IF(A6=\"\",\"\",ADV!G11)","v":"AT"},{"$f":"IF(A6=\"\",\"\",ADV!H11)","v":4000},{"$f":"IF(A6<>\"\",TRIM(ADV!I11&CHAR(10)&ADV!I12&CHAR(10)&ADV!I13&CHAR(10)&ADV!I14&CHAR(10)&ADV!I15&CHAR(10)&ADV!I16&CHAR(10)&ADV!I17&CHAR(10)&ADV!I18&CHAR(10)),\"\")","v":"Milestone 1\nMilestone 2\n\n\n\n\n\n\n"},{"$f":"IF(B6<>\"\",TRIM(ADV!J11&CHAR(10)&ADV!J12&CHAR(10)&ADV!J13&CHAR(10)&ADV!J14&CHAR(10)&ADV!J15&CHAR(10)&ADV!J16&CHAR(10)&ADV!J17&CHAR(10)&ADV!J18&CHAR(10)),\"\")","v":"2000\n2000\n\n\n\n\n\n\n"},{"$f":"IF(A6=\"\",\"\",ADV!K11)","v":"After signature of the Contract by both Parties"}]
[{"$f":"IF(ADV!A19=\"Yes\",ADV!D19,\"\")","v":""},{"$f":"IF(A7=\"\",\"\",ADV!E19)","v":""},{"$f":"IF(A7=\"\",\"\",ADV!F19)","v":""},{"$f":"IF(C7=\"\",\"\",ADV!G19)","v":""},{"$f":"IF(D7=\"\",\"\",ADV!H19)","v":""},{"$f":"IF(A7<>\"\",TRIM(ADV!I19&CHAR(10)&ADV!I20&CHAR(10)&ADV!I21&CHAR(10)&ADV!I22&CHAR(10)&ADV!I23&CHAR(10)&ADV!I24&CHAR(10)&ADV!I25&CHAR(10)&ADV!I26),\"\")","v":""},{"$f":"IF(B7<>\"\",TRIM(ADV!J19&CHAR(10)&ADV!J20&CHAR(10)&ADV!J21&CHAR(10)&ADV!J22&CHAR(10)&ADV!J23&CHAR(10)&ADV!J24&CHAR(10)&ADV!J25&CHAR(10)&ADV!J26),\"\")","v":""},{"$f":"IF(A7=\"\",\"\",ADV!K19)","v":""}]
[{"$f":"IF(ADV!A27=\"Yes\",ADV!D27,\"\")","v":""},{"$f":"IF(A8=\"\",\"\",ADV!E27)","v":""},{"$f":"IF(A8=\"\",\"\",ADV!F27)","v":""},{"$f":"IF(C8=\"\",\"\",ADV!G27)","v":""},{"$f":"IF(D8=\"\",\"\",ADV!H27)","v":""},{"$f":"IF(A8<>\"\",TRIM(ADV!I27&CHAR(10)&ADV!I28&CHAR(10)&ADV!I29&CHAR(10)&ADV!I30&CHAR(10)&ADV!I31&CHAR(10)&ADV!I32&CHAR(10)&ADV!I33&CHAR(10)&ADV!I34),\"\")","v":""},{"$f":"IF(B8<>\"\",TRIM(ADV!J27&CHAR(10)&ADV!J28&CHAR(10)&ADV!J29&CHAR(10)&ADV!J30&CHAR(10)&ADV!J31&CHAR(10)&ADV!J32&CHAR(10)&ADV!J33&CHAR(10)&ADV!J34),\"\")","v":""},{"$f":"IF(A8=\"\",\"\",ADV!K27)","v":""}]
[{"$f":"IF(ADV!A35=\"Yes\",ADV!D35,\"\")","v":""},{"$f":"IF(A9=\"\",\"\",ADV!E35)","v":""},{"$f":"IF(A9=\"\",\"\",ADV!F35)","v":""},{"$f":"IF(C9=\"\",\"\",ADV!G35)","v":""},{"$f":"IF(D9=\"\",\"\",ADV!H35)","v":""},{"$f":"IF(A9<>\"\",TRIM(ADV!I35&CHAR(10)&ADV!I36&CHAR(10)&ADV!I37&CHAR(10)&ADV!I38&CHAR(10)&ADV!I39&CHAR(10)&ADV!I40&CHAR(10)&ADV!I41&CHAR(10)&ADV!I42),\"\")","v":""},{"$f":"IF(B9<>\"\",TRIM(ADV!J35&CHAR(10)&ADV!J36&CHAR(10)&ADV!J37&CHAR(10)&ADV!J38&CHAR(10)&ADV!J39&CHAR(10)&ADV!J40&CHAR(10)&ADV!J41&CHAR(10)&ADV!J42),\"\")","v":""},{"$f":"IF(A9=\"\",\"\",ADV!K35)","v":""}]
[{"$f":"IF(ADV!A43=\"Yes\",ADV!D43,\"\")","v":""},{"$f":"IF(A10=\"\",\"\",ADV!E43)","v":""},{"$f":"IF(A10=\"\",\"\",ADV!F43)","v":""},{"$f":"IF(C10=\"\",\"\",ADV!G43)","v":""},{"$f":"IF(D10=\"\",\"\",ADV!H43)","v":""},{"$f":"IF(A10<>\"\",TRIM(ADV!I43&CHAR(10)&ADV!I44&CHAR(10)&ADV!I45&CHAR(10)&ADV!I46&CHAR(10)&ADV!I47&CHAR(10)&ADV!I48&CHAR(10)&ADV!I49&CHAR(10)&ADV!I50),\"\")","v":""},{"$f":"IF(B10<>\"\",TRIM(ADV!J43&CHAR(10)&ADV!J44&CHAR(10)&ADV!J45&CHAR(10)&ADV!J46&CHAR(10)&ADV!J47&CHAR(10)&ADV!J48&CHAR(10)&ADV!J49&CHAR(10)&ADV!J50),\"\")","v":""},{"$f":"IF(A10=\"\",\"\",ADV!K43)","v":""}]
[{"$f":"IF(ADV!A51=\"Yes\",ADV!D51,\"\")","v":""},{"$f":"IF(A11=\"\",\"\",ADV!E51)","v":""},{"$f":"IF(A11=\"\",\"\",ADV!F51)","v":""},{"$f":"IF(C11=\"\",\"\",ADV!G51)","v":""},{"$f":"IF(D11=\"\",\"\",ADV!H51)","v":""},{"$f":"IF(A11<>\"\",TRIM(ADV!I51&CHAR(10)&ADV!I52&CHAR(10)&ADV!I53&CHAR(10)&ADV!I54&CHAR(10)&ADV!I55&CHAR(10)&ADV!I56&CHAR(10)&ADV!I57&CHAR(10)&ADV!I58),\"\")","v":""},{"$f":"IF(B11<>\"\",TRIM(ADV!J51&CHAR(10)&ADV!J52&CHAR(10)&ADV!J53&CHAR(10)&ADV!J54&CHAR(10)&ADV!J55&CHAR(10)&ADV!J56&CHAR(10)&ADV!J57&CHAR(10)&ADV!J58),\"\")","v":""},{"$f":"IF(A11=\"\",\"\",ADV!K51)","v":""}]
[{"$f":"IF(ADV!A59=\"Yes\",ADV!D59,\"\")","v":""},{"$f":"IF(A12=\"\",\"\",ADV!E59)","v":""},{"$f":"IF(A12=\"\",\"\",ADV!F59)","v":""},{"$f":"IF(C12=\"\",\"\",ADV!G59)","v":""},{"$f":"IF(D12=\"\",\"\",ADV!H59)","v":""},{"$f":"IF(A12<>\"\",TRIM(ADV!I59&CHAR(10)&ADV!I60&CHAR(10)&ADV!I61&CHAR(10)&ADV!I62&CHAR(10)&ADV!I63&CHAR(10)&ADV!I64&CHAR(10)&ADV!I65&CHAR(10)&ADV!I66),\"\")","v":""},{"$f":"IF(B12<>\"\",TRIM(ADV!J59&CHAR(10)&ADV!J60&CHAR(10)&ADV!J61&CHAR(10)&ADV!J62&CHAR(10)&ADV!J63&CHAR(10)&ADV!J64&CHAR(10)&ADV!J65&CHAR(10)&ADV!J66),\"\")","v":""},{"$f":"IF(A12=\"\",\"\",ADV!K59)","v":""}]
[{"$f":"IF(ADV!A67=\"Yes\",ADV!D67,\"\")","v":""},{"$f":"IF(A13=\"\",\"\",ADV!E67)","v":""},{"$f":"IF(A13=\"\",\"\",ADV!F67)","v":""},{"$f":"IF(C13=\"\",\"\",ADV!G67)","v":""},{"$f":"IF(D13=\"\",\"\",ADV!H67)","v":""},{"$f":"IF(A13<>\"\",TRIM(ADV!I67&CHAR(10)&ADV!I68&CHAR(10)&ADV!I69&CHAR(10)&ADV!I70&CHAR(10)&ADV!I71&CHAR(10)&ADV!I72&CHAR(10)&ADV!I73&CHAR(10)&ADV!I74),\"\")","v":""},{"$f":"IF(B13<>\"\",TRIM(ADV!J67&CHAR(10)&ADV!J68&CHAR(10)&ADV!J69&CHAR(10)&ADV!J70&CHAR(10)&ADV!J71&CHAR(10)&ADV!J72&CHAR(10)&ADV!J73&CHAR(10)&ADV!J74),\"\")","v":""},{"$f":"IF(A13=\"\",\"\",ADV!K67)","v":""}]
[{"$f":"IF(ADV!A75=\"Yes\",ADV!D75,\"\")","v":""},{"$f":"IF(A14=\"\",\"\",ADV!E75)","v":""},{"$f":"IF(A14=\"\",\"\",ADV!F75)","v":""},{"$f":"IF(C14=\"\",\"\",ADV!G75)","v":""},{"$f":"IF(D14=\"\",\"\",ADV!H75)","v":""},{"$f":"IF(A14<>\"\",TRIM(ADV!I75&CHAR(10)&ADV!I76&CHAR(10)&ADV!I77&CHAR(10)&ADV!I78&CHAR(10)&ADV!I79&CHAR(10)&ADV!I80&CHAR(10)&ADV!I81&CHAR(10)&ADV!I82),\"\")","v":""},{"$f":"IF(B14<>\"\",TRIM(ADV!J75&CHAR(10)&ADV!J76&CHAR(10)&ADV!J77&CHAR(10)&ADV!J78&CHAR(10)&ADV!J79&CHAR(10)&ADV!J80&CHAR(10)&ADV!J81&CHAR(10)&ADV!J82),\"\")","v":""},{"$f":"IF(A14=\"\",\"\",ADV!K75)","v":""}]
[{"$f":"IF(ADV!A83=\"Yes\",ADV!D83,\"\")","v":""},{"$f":"IF(A15=\"\",\"\",ADV!E83)","v":""},{"$f":"IF(A15=\"\",\"\",ADV!F83)","v":""},{"$f":"IF(C15=\"\",\"\",ADV!G83)","v":""},{"$f":"IF(D15=\"\",\"\",ADV!H83)","v":""},{"$f":"IF(A15<>\"\",TRIM(ADV!I75&CHAR(10)&ADV!I76&CHAR(10)&ADV!I77&CHAR(10)&ADV!I78&CHAR(10)&ADV!I79&CHAR(10)&ADV!I80&CHAR(10)&ADV!I81&CHAR(10)&ADV!I82),\"\")","v":""},{"$f":"IF(B15<>\"\",TRIM(ADV!J75&CHAR(10)&ADV!J76&CHAR(10)&ADV!J77&CHAR(10)&ADV!J78&CHAR(10)&ADV!J79&CHAR(10)&ADV!J80&CHAR(10)&ADV!J81&CHAR(10)&ADV!J82),\"\")","v":""},{"$f":"IF(A15=\"\",\"\",ADV!K83)","v":""}]
[{"$f":"IF(ADV!A91=\"Yes\",ADV!D91,\"\")","v":""},{"$f":"IF(A16=\"\",\"\",ADV!E91)","v":""},{"$f":"IF(A16=\"\",\"\",ADV!F91)","v":""},{"$f":"IF(C16=\"\",\"\",ADV!G91)","v":""},{"$f":"IF(D16=\"\",\"\",ADV!H91)","v":""},{"$f":"IF(A16<>\"\",TRIM(ADV!I91&CHAR(10)&ADV!I92&CHAR(10)&ADV!I93&CHAR(10)&ADV!I94&CHAR(10)&ADV!I95&CHAR(10)&ADV!I96&CHAR(10)&ADV!I97&CHAR(10)&ADV!I98),\"\")","v":""},{"$f":"IF(B16<>\"\",TRIM(ADV!J91&CHAR(10)&ADV!J92&CHAR(10)&ADV!J93&CHAR(10)&ADV!J94&CHAR(10)&ADV!J95&CHAR(10)&ADV!J96&CHAR(10)&ADV!J97&CHAR(10)&ADV!J98),\"\")","v":""},{"$f":"IF(A16=\"\",\"\",ADV!K91)","v":""}]
[]
[]
["Phase 2 - Advance Breakdown"]
["For Information purposes only: "]
["Amounts in Euro for Contractor and Subcontractor(s)"]
["Prime (P) / Subco (SI)",{"$f":" \"Company\" & CHAR(10) & \"Name\"","v":"Company\nName"},"Vendor Code \n(at contract \nsignature)","Country (ISO code)","Advance Payment (in Euro)","Offset against","Offset by Euro","Condition for release of the Advance Payment (if applicable)"]
[{"$f":"IF(ADV!A104=\"Yes\",ADV!D104,\"\")","v":"P"},{"$f":"IF(A23=\"\",\"\",ADV!E104)","v":"Our Company"},{"$f":"IF(A23=\"\",\"\",ADV!F104)","v":"100 xxx-xxx"},{"$f":"IF(A23=\"\",\"\",ADV!G104)","v":"IT"},{"$f":"IF(A23=\"\",\"\",ADV!H104)","v":50000},{"$f":"IF(A23=\"\",\"\",TRIM(ADV!I104&CHAR(10)&ADV!I105&CHAR(10)&ADV!I106&CHAR(10)&ADV!I107&CHAR(10)&ADV!I108&CHAR(10)&ADV!I109&CHAR(10)&ADV!I110&CHAR(10)&ADV!I111&CHAR(10)))","v":"Milestone 1\nMilestone 2\nMilestone 3\nMilestone 4\n\n\n\n\n"},{"$f":"IF(A23=\"\",\"\",TRIM(ADV!J104&CHAR(10)&ADV!J105&CHAR(10)&ADV!J106&CHAR(10)&ADV!J107&CHAR(10)&ADV!J108&CHAR(10)&ADV!J109&CHAR(10)&ADV!J110&CHAR(10)&ADV!J111&CHAR(10)))","v":"10000\n10000\n10000\n10000\n\n\n\n\n"},{"$f":"IF(A23=\"\",\"\",ADV!K104)","v":"After signature of the Contract by both Parties"}]
[{"$f":"IF(ADV!A112=\"Yes\",ADV!D112,\"\")","v":""},{"$f":"IF(A24=\"\",\"\",ADV!E112)","v":""},{"$f":"IF(A24=\"\",\"\",ADV!F112)","v":""},{"$f":"IF(A24=\"\",\"\",ADV!G112)","v":""},{"$f":"IF(A24=\"\",\"\",ADV!H112)","v":""},{"$f":"IF(A24<>\"\",TRIM(ADV!I112&CHAR(10)&ADV!I113&CHAR(10)&ADV!I114&CHAR(10)&ADV!I115&CHAR(10)&ADV!I116&CHAR(10)&ADV!I117&CHAR(10)&ADV!I118&CHAR(10)&ADV!I119&CHAR(10)),\"\")","v":""},{"$f":"IF(B24<>\"\",TRIM(ADV!J112&CHAR(10)&ADV!J113&CHAR(10)&ADV!J114&CHAR(10)&ADV!J115&CHAR(10)&ADV!J116&CHAR(10)&ADV!J117&CHAR(10)&ADV!J118&CHAR(10)&ADV!J119&CHAR(10)),\"\")","v":""},{"$f":"IF(A24=\"\",\"\",ADV!K112)","v":""}]
[{"$f":"IF(ADV!A120=\"Yes\",ADV!D120,\"\")","v":""},{"$f":"IF(A25=\"\",\"\",ADV!E120)","v":""},{"$f":"IF(A25=\"\",\"\",ADV!F120)","v":""},{"$f":"IF(C25=\"\",\"\",ADV!G120)","v":""},{"$f":"IF(D25=\"\",\"\",ADV!H120)","v":""},{"$f":"IF(A25<>\"\",TRIM(ADV!I120&CHAR(10)&ADV!I121&CHAR(10)&ADV!I122&CHAR(10)&ADV!I123&CHAR(10)&ADV!I124&CHAR(10)&ADV!I125&CHAR(10)&ADV!I126&CHAR(10)&ADV!I127),\"\")","v":""},{"$f":"IF(B25<>\"\",TRIM(ADV!J120&CHAR(10)&ADV!J121&CHAR(10)&ADV!J122&CHAR(10)&ADV!J123&CHAR(10)&ADV!J124&CHAR(10)&ADV!J125&CHAR(10)&ADV!J126&CHAR(10)&ADV!J127),\"\")","v":""},{"$f":"IF(A25=\"\",\"\",ADV!K120)","v":""}]
[{"$f":"IF(ADV!A128=\"Yes\",ADV!D128,\"\")","v":""},{"$f":"IF(A26=\"\",\"\",ADV!E128)","v":""},{"$f":"IF(A26=\"\",\"\",ADV!F128)","v":""},{"$f":"IF(C26=\"\",\"\",ADV!G128)","v":""},{"$f":"IF(D26=\"\",\"\",ADV!H128)","v":""},{"$f":"IF(A26<>\"\",TRIM(ADV!I128&CHAR(10)&ADV!I129&CHAR(10)&ADV!I130&CHAR(10)&ADV!I131&CHAR(10)&ADV!I132&CHAR(10)&ADV!I133&CHAR(10)&ADV!I134&CHAR(10)&ADV!I135),\"\")","v":""},{"$f":"IF(B26<>\"\",TRIM(ADV!J128&CHAR(10)&ADV!J129&CHAR(10)&ADV!J130&CHAR(10)&ADV!J131&CHAR(10)&ADV!J132&CHAR(10)&ADV!J133&CHAR(10)&ADV!J134&CHAR(10)&ADV!J135),\"\")","v":""},{"$f":"IF(A26=\"\",\"\",ADV!K128)","v":""}]
[{"$f":"IF(ADV!A136=\"Yes\",ADV!D136,\"\")","v":""},{"$f":"IF(A27=\"\",\"\",ADV!E136)","v":""},{"$f":"IF(A27=\"\",\"\",ADV!F136)","v":""},{"$f":"IF(C27=\"\",\"\",ADV!G136)","v":""},{"$f":"IF(D27=\"\",\"\",ADV!H136)","v":""},{"$f":"IF(A27<>\"\",TRIM(ADV!I136&CHAR(10)&ADV!I137&CHAR(10)&ADV!I138&CHAR(10)&ADV!I139&CHAR(10)&ADV!I140&CHAR(10)&ADV!I141&CHAR(10)&ADV!I142&CHAR(10)&ADV!I143),\"\")","v":""},{"$f":"IF(B27<>\"\",TRIM(ADV!J136&CHAR(10)&ADV!J137&CHAR(10)&ADV!J138&CHAR(10)&ADV!J139&CHAR(10)&ADV!J140&CHAR(10)&ADV!J141&CHAR(10)&ADV!J142&CHAR(10)&ADV!J143),\"\")","v":""},{"$f":"IF(A27=\"\",\"\",ADV!K136)","v":""}]
[{"$f":"IF(ADV!A144=\"Yes\",ADV!D144,\"\")","v":""},{"$f":"IF(A28=\"\",\"\",ADV!E144)","v":""},{"$f":"IF(A28=\"\",\"\",ADV!F144)","v":""},{"$f":"IF(C28=\"\",\"\",ADV!G144)","v":""},{"$f":"IF(D28=\"\",\"\",ADV!H144)","v":""},{"$f":"IF(A28<>\"\",TRIM(ADV!I144&CHAR(10)&ADV!I145&CHAR(10)&ADV!I146&CHAR(10)&ADV!I147&CHAR(10)&ADV!I148&CHAR(10)&ADV!I149&CHAR(10)&ADV!I150&CHAR(10)&ADV!I151),\"\")","v":""},{"$f":"IF(B28<>\"\",TRIM(ADV!J144&CHAR(10)&ADV!J145&CHAR(10)&ADV!J146&CHAR(10)&ADV!J147&CHAR(10)&ADV!J148&CHAR(10)&ADV!J149&CHAR(10)&ADV!J150&CHAR(10)&ADV!J151),\"\")","v":""},{"$f":"IF(A28=\"\",\"\",ADV!K144)","v":""}]
[{"$f":"IF(ADV!A152=\"Yes\",ADV!D152,\"\")","v":""},{"$f":"IF(A29=\"\",\"\",ADV!E152)","v":""},{"$f":"IF(A29=\"\",\"\",ADV!F152)","v":""},{"$f":"IF(C29=\"\",\"\",ADV!G152)","v":""},{"$f":"IF(D29=\"\",\"\",ADV!H152)","v":""},{"$f":"IF(A29<>\"\",TRIM(ADV!I152&CHAR(10)&ADV!I153&CHAR(10)&ADV!I154&CHAR(10)&ADV!I155&CHAR(10)&ADV!I156&CHAR(10)&ADV!I157&CHAR(10)&ADV!I158&CHAR(10)&ADV!I159),\"\")","v":""},{"$f":"IF(B29<>\"\",TRIM(ADV!J152&CHAR(10)&ADV!J153&CHAR(10)&ADV!J154&CHAR(10)&ADV!J155&CHAR(10)&ADV!J156&CHAR(10)&ADV!J157&CHAR(10)&ADV!J158&CHAR(10)&ADV!J159),\"\")","v":""},{"$f":"IF(A29=\"\",\"\",ADV!K152)","v":""}]
[{"$f":"IF(ADV!A160=\"Yes\",ADV!D160,\"\")","v":""},{"$f":"IF(A30=\"\",\"\",ADV!E160)","v":""},{"$f":"IF(A30=\"\",\"\",ADV!F160)","v":""},{"$f":"IF(C30=\"\",\"\",ADV!G160)","v":""},{"$f":"IF(D30=\"\",\"\",ADV!H160)","v":""},{"$f":"IF(A30<>\"\",TRIM(ADV!I160&CHAR(10)&ADV!I161&CHAR(10)&ADV!I162&CHAR(10)&ADV!I163&CHAR(10)&ADV!I164&CHAR(10)&ADV!I165&CHAR(10)&ADV!I166&CHAR(10)&ADV!I167),\"\")","v":""},{"$f":"IF(B30<>\"\",TRIM(ADV!J160&CHAR(10)&ADV!J161&CHAR(10)&ADV!J162&CHAR(10)&ADV!J163&CHAR(10)&ADV!J164&CHAR(10)&ADV!J165&CHAR(10)&ADV!J166&CHAR(10)&ADV!J167),\"\")","v":""},{"$f":"IF(A30=\"\",\"\",ADV!K160)","v":""}]
[{"$f":"IF(ADV!A168=\"Yes\",ADV!D168,\"\")","v":""},{"$f":"IF(A31=\"\",\"\",ADV!E168)","v":""},{"$f":"IF(A31=\"\",\"\",ADV!F168)","v":""},{"$f":"IF(C31=\"\",\"\",ADV!G168)","v":""},{"$f":"IF(D31=\"\",\"\",ADV!H168)","v":""},{"$f":"IF(A31<>\"\",TRIM(ADV!I168&CHAR(10)&ADV!I169&CHAR(10)&ADV!I170&CHAR(10)&ADV!I171&CHAR(10)&ADV!I172&CHAR(10)&ADV!I173&CHAR(10)&ADV!I174&CHAR(10)&ADV!I175),\"\")","v":""},{"$f":"IF(B31<>\"\",TRIM(ADV!J168&CHAR(10)&ADV!J169&CHAR(10)&ADV!J170&CHAR(10)&ADV!J171&CHAR(10)&ADV!J172&CHAR(10)&ADV!J173&CHAR(10)&ADV!J174&CHAR(10)&ADV!J175),\"\")","v":""},{"$f":"IF(A31=\"\",\"\",ADV!K168)","v":""}]
[{"$f":"IF(ADV!A176=\"Yes\",ADV!D176,\"\")","v":""},{"$f":"IF(A32=\"\",\"\",ADV!E176)","v":""},{"$f":"IF(A32=\"\",\"\",ADV!F176)","v":""},{"$f":"IF(C32=\"\",\"\",ADV!G176)","v":""},{"$f":"IF(D32=\"\",\"\",ADV!H176)","v":""},{"$f":"IF(A32<>\"\",TRIM(ADV!I176&CHAR(10)&ADV!I177&CHAR(10)&ADV!I178&CHAR(10)&ADV!I179&CHAR(10)&ADV!I180&CHAR(10)&ADV!I181&CHAR(10)&ADV!I182&CHAR(10)&ADV!I183),\"\")","v":""},{"$f":"IF(B32<>\"\",TRIM(ADV!J176&CHAR(10)&ADV!J177&CHAR(10)&ADV!J178&CHAR(10)&ADV!J179&CHAR(10)&ADV!J180&CHAR(10)&ADV!J181&CHAR(10)&ADV!J182&CHAR(10)&ADV!J183),\"\")","v":""},{"$f":"IF(A32=\"\",\"\",ADV!K176)","v":""}]
[{"$f":"IF(ADV!A184=\"Yes\",ADV!D184,\"\")","v":""},{"$f":"IF(A33=\"\",\"\",ADV!E184)","v":""},{"$f":"IF(A33=\"\",\"\",ADV!F184)","v":""},{"$f":"IF(C33=\"\",\"\",ADV!G184)","v":""},{"$f":"IF(D33=\"\",\"\",ADV!H184)","v":""},{"$f":"IF(A33<>\"\",TRIM(ADV!I184&CHAR(10)&ADV!I185&CHAR(10)&ADV!I186&CHAR(10)&ADV!I187&CHAR(10)&ADV!I188&CHAR(10)&ADV!I189&CHAR(10)&ADV!I190&CHAR(10)&ADV!I191),\"\")","v":""},{"$f":"IF(B33<>\"\",TRIM(ADV!J184&CHAR(10)&ADV!J185&CHAR(10)&ADV!J186&CHAR(10)&ADV!J187&CHAR(10)&ADV!J188&CHAR(10)&ADV!J189&CHAR(10)&ADV!J190&CHAR(10)&ADV!J191),\"\")","v":""},{"$f":"IF(A33=\"\",\"\",ADV!K184)","v":""}]
[{"$f":"IF(ADV!A192=\"Yes\",ADV!D192,\"\")","v":""},{"$f":"IF(A34=\"\",\"\",ADV!E192)","v":""},{"$f":"IF(A34=\"\",\"\",ADV!F192)","v":""},{"$f":"IF(C34=\"\",\"\",ADV!G192)","v":""},{"$f":"IF(D34=\"\",\"\",ADV!H192)","v":""},{"$f":"IF(A34<>\"\",TRIM(ADV!I192&CHAR(10)&ADV!I193&CHAR(10)&ADV!I194&CHAR(10)&ADV!I195&CHAR(10)&ADV!I196&CHAR(10)&ADV!I197&CHAR(10)&ADV!I198&CHAR(10)&ADV!I199),\"\")","v":""},{"$f":"IF(B34<>\"\",TRIM(ADV!J192&CHAR(10)&ADV!J193&CHAR(10)&ADV!J194&CHAR(10)&ADV!J195&CHAR(10)&ADV!J196&CHAR(10)&ADV!J197&CHAR(10)&ADV!J198&CHAR(10)&ADV!J199),\"\")","v":""},{"$f":"IF(A34=\"\",\"\",ADV!K192)","v":""}]

{"sheet":"TableDeliverables","index":14,"n_rows":144,"n_cols":14,"rows_kept":144,"cut":false,"hidden":false,"merged":[[0,0,0,1],[1,13,1,17],[28,0,28,1],[71,0,71,1],[99,0,99,1],[122,0,122,1],[3,3,3,8],[6,3,6,8],[8,3,8,8]]}
["Management Documents",null,"Table 1 of 5"]
["ID","TITLE","ACRONYM",{"$f":"IF(Deliverables!E2<>\"\",Deliverables!E2,\"\")","v":"RR"},{"$f":"IF(Deliverables!F2<>\"\",Deliverables!F2,\"\")","v":"PDR"},{"$f":"IF(Deliverables!G2<>\"\",Deliverables!G2,\"\")","v":"CDR"},{"$f":"IF(Deliverables!H2<>\"\",Deliverables!H2,\"\")","v":"TRR"},{"$f":"IF(Deliverables!I2<>\"\",Deliverables!I2,\"\")","v":"QAR"},{"$f":"IF(Deliverables!J2<>\"\",Deliverables!J2,\"\")","v":"IOCR"},{"$f":"IF(Deliverables!K2<>\"\",Deliverables!K2,\"\")","v":"DCCR"},{"$f":"IF(Deliverables!L2<>\"\",Deliverables!L2,\"\")","v":"FR"},null,null,"Keep scrolling down for the other tables!"]
[{"$f":"IF(Deliverables!B4<>\"\",Deliverables!B4,\"\")","v":"S.MG01"},{"$f":"IF(A3<>\"\",Deliverables!C4,\"\")","v":"Configuration and Documentation Management Plan"},{"$f":"IF(A3<>\"\",Deliverables!D4,\"\")","v":"CMDP"},{"$f":"IF(AND(A3<>\"\",Deliverables!E4<>\"\"),Deliverables!E4,\"\")","v":"N"},{"$f":"IF(AND(A3<>\"\",Deliverables!F4<>\"\"),Deliverables!F4,\"\")","v":"U"},{"$f":"IF(AND(A3<>\"\",Deliverables!G4<>\"\"),Deliverables!G4,\"\")","v":""},{"$f":"IF(AND(A3<>\"\",Deliverables!H4<>\"\"),Deliverables!H4,\"\")","v":""},{"$f":"IF(AND(A3<>\"\",Deliverables!I4<>\"\"),Deliverables!I4,\"\")","v":""},{"$f":"IF(AND(A3<>\"\",Deliverables!J4<>\"\"),Deliverables!J4,\"\")","v":""},{"$f":"IF(AND(A3<>\"\",Deliverables!K4<>\"\"),Deliverables!K4,\"\")","v":"C"},{"$f":"IF(AND(A3<>\"\",Deliverables!L4<>\"\"),Deliverables!L4,\"\")","v":"C"}]
[{"$f":"IF(Deliverables!B5<>\"\",Deliverables!B5,\"\")","v":"S.MG02"},{"$f":"IF(A4<>\"\",Deliverables!C5,\"\")","v":"Risk Register"},{"$f":"IF(A4<>\"\",Deliverables!D5,\"\")","v":"RR"},{"$f":"IF(A4<>\"\",Deliverables!E5,\"\")","v":"Monthly and at each progress meeting/review"},null,null,null,null,null,{"$f":"IF(AND(A4<>\"\",Deliverables!K5<>\"\"),Deliverables!K5,\"\")","v":""},{"$f":"IF(AND(A4<>\"\",Deliverables!L5<>\"\"),Deliverables!L5,\"\")","v":""}]
[{"$f":"IF(Deliverables!B6<>\"\",Deliverables!B6,\"\")","v":"S.MG03"},{"$f":"IF(A5<>\"\",Deliverables!C6,\"\")","v":"Business Plan"},{"$f":"IF(A5<>\"\",Deliverables!D6,\"\")","v":"BP"},{"$f":"IF(AND(A5<>\"\",Deliverables!E6<>\"\"),Deliverables!E6,\"\")","v":"N"},{"$f":"IF(AND(A5<>\"\",Deliverables!F6<>\"\"),Deliverables!F6,\"\")","v":"U"},{"$f":"IF(AND(A5<>\"\",Deliverables!G6<>\"\"),Deliverables!G6,\"\")","v":"U"},{"$f":"IF(AND(A5<>\"\",Deliverables!H6<>\"\"),Deliverables!H6,\"\")","v":"U"},{"$f":"IF(AND(A5<>\"\",Deliverables!I6<>\"\"),Deliverables!I6,\"\")","v":"U"},{"$f":"IF(AND(A5<>\"\",Deliverables!J6<>\"\"),Deliverables!J6,\"\")","v":"U"},{"$f":"IF(AND(A5<>\"\",Deliverables!K6<>\"\"),Deliverables!K6,\"\")","v":"U"},{"$f":"IF(AND(A5<>\"\",Deliverables!L6<>\"\"),Deliverables!L6,\"\")","v":"U"}]
[{"$f":"IF(Deliverables!B7<>\"\",Deliverables!B7,\"\")","v":"S.MG04"},{"$f":"IF(A6<>\"\",Deliverables!C7,\"\")","v":"Document List"},{"$f":"IF(A6<>\"\",Deliverables!D7,\"\")","v":"DL"},{"$f":"IF(AND(A6<>\"\",Deliverables!E7<>\"\"),Deliverables!E7,\"\")","v":"N"},{"$f":"IF(AND(A6<>\"\",Deliverables!F7<>\"\"),Deliverables!F7,\"\")","v":"U"},{"$f":"IF(AND(A6<>\"\",Deliverables!G7<>\"\"),Deliverables!G7,\"\")","v":"U"},{"$f":"IF(AND(A6<>\"\",Deliverables!H7<>\"\"),Deliverables!H7,\"\")","v":"U"},{"$f":"IF(AND(A6<>\"\",Deliverables!I7<>\"\"),Deliverables!I7,\"\")","v":"U"},{"$f":"IF(AND(A6<>\"\",Deliverables!J7<>\"\"),Deliverables!J7,\"\")","v":"U"},{"$f":"IF(AND(A6<>\"\",Deliverables!K7<>\"\"),Deliverables!K7,\"\")","v":"U"},{"$f":"IF(AND(A6<>\"\",Deliverables!L7<>\"\"),Deliverables!L7,\"\")","v":"U"}]
[{"$f":"IF(Deliverables!B8<>\"\",Deliverables!B8,\"\")","v":"S.MG05"},{"$f":"IF(A7<>\"\",Deliverables!C8,\"\")","v":"Monthly Progress Report"},{"$f":"IF(A7<>\"\",Deliverables!D8,\"\")","v":"MPR"},{"$f":"IF(A7<>\"\",Deliverables!E8,\"\")","v":"Monthly"},null,null,null,null,null,{"$f":"IF(AND(A7<>\"\",Deliverables!K8<>\"\"),Deliverables!K8,\"\")","v":""},{"$f":"IF(AND(A7<>\"\",Deliverables!L8<>\"\"),Deliverables!L8,\"\")","v":""}]
[{"$f":"IF(Deliverables!B9<>\"\",Deliverables!B9,\"\")","v":"S.MG06"},{"$f":"IF(A8<>\"\",Deliverables!C9,\"\")","v":"Minutes of the Meeting"},{"$f":"IF(A8<>\"\",Deliverables!D9,\"\")","v":"MoM"},{"$f":"IF(AND(A8<>\"\",Deliverables!E9<>\"\"),Deliverables!E9,\"\")","v":"N"},{"$f":"IF(AND(A8<>\"\",Deliverables!F9<>\"\"),Deliverables!F9,\"\")","v":"N"},{"$f":"IF(AND(A8<>\"\",Deliverables!G9<>\"\"),Deliverables!G9,\"\")","v":"N"},{"$f":"IF(AND(A8<>\"\",Deliverables!H9<>\"\"),Deliverables!H9,\"\")","v":"N"},{"$f":"IF(AND(A8<>\"\",Deliverables!I9<>\"\"),Deliverables!I9,\"\")","v":"N"},{"$f":"IF(AND(A8<>\"\",Deliverables!J9<>\"\"),Deliverables!J9,\"\")","v":"N"},{"$f":"IF(AND(A8<>\"\",Deliverables!K9<>\"\"),Deliverables!K9,\"\")","v":"N"},{"$f":"IF(AND(A8<>\"\",Deliverables!L9<>\"\"),Deliverables!L9,\"\")","v":"N"}]
[{"$f":"IF(Deliverables!B10<>\"\",Deliverables!B10,\"\")","v":"S.MG07"},{"$f":"IF(A9<>\"\",Deliverables!C10,\"\")","v":"Activity Web Page"},{"$f":"IF(A9<>\"\",Deliverables!D10,\"\")","v":"AWP"},{"$f":"IF(A9<>\"\",Deliverables!E10,\"\")","v":"At the first review meeting and current status updated at each review"},null,null,null,null,null,{"$f":"IF(AND(A9<>\"\",Deliverables!K10<>\"\"),Deliverables!K10,\"\")","v":""},{"$f":"IF(AND(A9<>\"\",Deliverables!L10<>\"\"),Deliverables!L10,\"\")","v":""}]
[{"$f":"IF(Deliverables!B11<>\"\",Deliverables!B11,\"\")","v":"S.MG08"},{"$f":"IF(A10<>\"\",Deliverables!C11,\"\")","v":"Justification for non continuation"},{"$f":"IF(A10<>\"\",Deliverables!D11,\"\")","v":"JFNC"},{"$f":"IF(AND(A10<>\"\",Deliverables!E11<>\"\"),Deliverables!E11,\"\")","v":""},{"$f":"IF(AND(A10<>\"\",Deliverables!F11<>\"\"),Deliverables!F11,\"\")","v":""},{"$f":"IF(AND(A10<>\"\",Deliverables!G11<>\"\"),Deliverables!G11,\"\")","v":""},{"$f":"IF(AND(A10<>\"\",Deliverables!H11<>\"\"),Deliverables!H11,\"\")","v":""},{"$f":"IF(AND(A10<>\"\",Deliverables!I11<>\"\"),Deliverables!I11,\"\")","v":""},{"$f":"IF(AND(A10<>\"\",Deliverables!J11<>\"\"),Deliverables!J11,\"\")","v":""},{"$f":"IF(AND(A10<>\"\",Deliverables!K11<>\"\"),Deliverables!K11,\"\")","v":"N"},{"$f":"IF(AND(A10<>\"\",Deliverables!L11<>\"\"),Deliverables!L11,\"\")","v":""}]
[{"$f":"IF(Deliverables!B12<>\"\",Deliverables!B12,\"\")","v":"S.MG09"},{"$f":"IF(A11<>\"\",Deliverables!C12,\"\")","v":"Digital Media"},{"$f":"IF(A11<>\"\",Deliverables!D12,\"\")","v":"DM"},{"$f":"IF(AND(A11<>\"\",Deliverables!E12<>\"\"),Deliverables!E12,\"\")","v":""},{"$f":"IF(AND(A11<>\"\",Deliverables!F12<>\"\"),Deliverables!F12,\"\")","v":""},{"$f":"IF(AND(A11<>\"\",Deliverables!G12<>\"\"),Deliverables!G12,\"\")","v":""},{"$f":"IF(AND(A11<>\"\",Deliverables!H12<>\"\"),Deliverables!H12,\"\")","v":""},{"$f":"IF(AND(A11<>\"\",Deliverables!I12<>\"\"),Deliverables!I12,\"\")","v":""},{"$f":"IF(AND(A11<>\"\",Deliverables!J12<>\"\"),Deliverables!J12,\"\")","v":""},{"$f":"IF(AND(A11<>\"\",Deliverables!K12<>\"\"),Deliverables!K12,\"\")","v":"N"},{"$f":"IF(AND(A11<>\"\",Deliverables!L12<>\"\"),Deliverables!L12,\"\")","v":"N"}]
[{"$f":"IF(Deliverables!B13<>\"\",Deliverables!B13,\"\")","v":"S.MG10"},{"$f":"IF(A12<>\"\",Deliverables!C13,\"\")","v":"Product Data Sheet"},{"$f":"IF(A12<>\"\",Deliverables!D13,\"\")","v":"PDS"},{"$f":"IF(AND(A12<>\"\",Deliverables!E13<>\"\"),Deliverables!E13,\"\")","v":""},{"$f":"IF(AND(A12<>\"\",Deliverables!F13<>\"\"),Deliverables!F13,\"\")","v":""},{"$f":"IF(AND(A12<>\"\",Deliverables!G13<>\"\"),Deliverables!G13,\"\")","v":""},{"$f":"IF(AND(A12<>\"\",Deliverables!H13<>\"\"),Deliverables!H13,\"\")","v":""},{"$f":"IF(AND(A12<>\"\",Deliverables!I13<>\"\"),Deliverables!I13,\"\")","v":""},{"$f":"IF(AND(A12<>\"\",Deliverables!J13<>\"\"),Deliverables!J13,\"\")","v":""},{"$f":"IF(AND(A12<>\"\",Deliverables!K13<>\"\"),Deliverables!K13,\"\")","v":""},{"$f":"IF(AND(A12<>\"\",Deliverables!L13<>\"\"),Deliverables!L13,\"\")","v":"N"}]
[{"$f":"IF(Deliverables!B14<>\"\",Deliverables!B14,\"\")","v":"S.MG11"},{"$f":"IF(A13<>\"\",Deliverables!C14,\"\")","v":"CCN for follow-on Cycle(s)"},{"$f":"IF(A13<>\"\",Deliverables!D14,\"\")","v":"CCN-FOC"},{"$f":"IF(AND(A13<>\"\",Deliverables!E14<>\"\"),Deliverables!E14,\"\")","v":""},{"$f":"IF(AND(A13<>\"\",Deliverables!F14<>\"\"),Deliverables!F14,\"\")","v":""},{"$f":"IF(AND(A13<>\"\",Deliverables!G14<>\"\"),Deliverables!G14,\"\")","v":""},{"$f":"IF(AND(A13<>\"\",Deliverables!H14<>\"\"),Deliverables!H14,\"\")","v":""},{"$f":"IF(AND(A13<>\"\",Deliverables!I14<>\"\"),Deliverables!I14,\"\")","v":""},{"$f":"IF(AND(A13<>\"\",Deliverables!J14<>\"\"),Deliverables!J14,\"\")","v":""},{"$f":"IF(AND(A13<>\"\",Deliverables!K14<>\"\"),Deliverables!K14,\"\")","v":"N"},{"$f":"IF(AND(A13<>\"\",Deliverables!L14<>\"\"),Deliverables!L14,\"\")","v":""}]
[{"$f":"IF(Deliverables!B15<>\"\",Deliverables!B15,\"\")","v":"S.MG12"},{"$f":"IF(A14<>\"\",Deliverables!C15,\"\")","v":"Contract Achievements and Socio Economic Impact Questionnaire"},{"$f":"IF(A14<>\"\",Deliverables!D15,\"\")","v":"CA-SEIQ"},{"$f":"IF(AND(A14<>\"\",Deliverables!E15<>\"\"),Deliverables!E15,\"\")","v":""},{"$f":"IF(AND(A14<>\"\",Deliverables!F15<>\"\"),Deliverables!F15,\"\")","v":""},{"$f":"IF(AND(A14<>\"\",Deliverables!G15<>\"\"),Deliverables!G15,\"\")","v":""},{"$f":"IF(AND(A14<>\"\",Deliverables!H15<>\"\"),Deliverables!H15,\"\")","v":""},{"$f":"IF(AND(A14<>\"\",Deliverables!I15<>\"\"),Deliverables!I15,\"\")","v":""},{"$f":"IF(AND(A14<>\"\",Deliverables!J15<>\"\"),Deliverables!J15,\"\")","v":""},{"$f":"IF(AND(A14<>\"\",Deliverables!K15<>\"\"),Deliverables!K15,\"\")","v":"N"},{"$f":"IF(AND(A14<>\"\",Deliverables!L15<>\"\"),Deliverables!L15,\"\")","v":"N"}]
[{"$f":"IF(Deliverables!B16<>\"\",Deliverables!B16,\"\")","v":"S.MG13"},{"$f":"IF(A15<>\"\",Deliverables!C16,\"\")","v":"Final Data Package"},{"$f":"IF(A15<>\"\",Deliverables!D16,\"\")","v":"FDP"},{"$f":"IF(AND(A15<>\"\",Deliverables!E16<>\"\"),Deliverables!E16,\"\")","v":""},{"$f":"IF(AND(A15<>\"\",Deliverables!F16<>\"\"),Deliverables!F16,\"\")","v":""},{"$f":"IF(AND(A15<>\"\",Deliverables!G16<>\"\"),Deliverables!G16,\"\")","v":""},{"$f":"IF(AND(A15<>\"\",Deliverables!H16<>\"\"),Deliverables!H16,\"\")","v":""},{"$f":"IF(AND(A15<>\"\",Deliverables!I16<>\"\"),Deliverables!I16,\"\")","v":""},{"$f":"IF(AND(A15<>\"\",Deliverables!J16<>\"\"),Deliverables!J16,\"\")","v":""},{"$f":"IF(AND(A15<>\"\",Deliverables!K16<>\"\"),Deliverables!K16,\"\")","v":"N"},{"$f":"IF(AND(A15<>\"\",Deliverables!L16<>\"\"),Deliverables!L16,\"\")","v":"N"}]
[{"$f":"IF(Deliverables!B17<>\"\",Deliverables!B17,\"\")","v":"S.MG14"},{"$f":"IF(A16<>\"\",Deliverables!C17,\"\")","v":"Final Report"},{"$f":"IF(A16<>\"\",Deliverables!D17,\"\")","v":"FREP"},{"$f":"IF(AND(A16<>\"\",Deliverables!E17<>\"\"),Deliverables!E17,\"\")","v":""},{"$f":"IF(AND(A16<>\"\",Deliverables!F17<>\"\"),Deliverables!F17,\"\")","v":""},{"$f":"IF(AND(A16<>\"\",Deliverables!G17<>\"\"),Deliverables!G17,\"\")","v":""},{"$f":"IF(AND(A16<>\"\",Deliverables!H17<>\"\"),Deliverables!H17,\"\")","v":""},{"$f":"IF(AND(A16<>\"\",Deliverables!I17<>\"\"),Deliverables!I17,\"\")","v":""},{"$f":"IF(AND(A16<>\"\",Deliverables!J17<>\"\"),Deliverables!J17,\"\")","v":""},{"$f":"IF(AND(A16<>\"\",Deliverables!K17<>\"\"),Deliverables!K17,\"\")","v":"N"},{"$f":"IF(AND(A16<>\"\",Deliverables!L17<>\"\"),Deliverables!L17,\"\")","v":"N"}]
[{"$f":"IF(Deliverables!B18<>\"\",Deliverables!B18,\"\")","v":""},{"$f":"IF(A17<>\"\",Deliverables!C18,\"\")","v":""},{"$f":"IF(A17<>\"\",Deliverables!D18,\"\")","v":""},{"$f":"IF(AND(A17<>\"\",Deliverables!E18<>\"\"),Deliverables!E18,\"\")","v":""},{"$f":"IF(AND(A17<>\"\",Deliverables!F18<>\"\"),Deliverables!F18,\"\")","v":""},{"$f":"IF(AND(A17<>\"\",Deliverables!G18<>\"\"),Deliverables!G18,\"\")","v":""},{"$f":"IF(AND(A17<>\"\",Deliverables!H18<>\"\"),Deliverables!H18,\"\")","v":""},{"$f":"IF(AND(A17<>\"\",Deliverables!I18<>\"\"),Deliverables!I18,\"\")","v":""},{"$f":"IF(AND(A17<>\"\",Deliverables!J18<>\"\"),Deliverables!J18,\"\")","v":""},{"$f":"IF(AND(A17<>\"\",Deliverables!K18<>\"\"),Deliverables!K18,\"\")","v":""},{"$f":"IF(AND(A17<>\"\",Deliverables!L18<>\"\"),Deliverables!L18,\"\")","v":""}]
[{"$f":"IF(Deliverables!B19<>\"\",Deliverables!B19,\"\")","v":""},{"$f":"IF(A18<>\"\",Deliverables!C19,\"\")","v":""},{"$f":"IF(A18<>\"\",Deliverables!D19,\"\")","v":""},{"$f":"IF(AND(A18<>\"\",Deliverables!E19<>\"\"),Deliverables!E19,\"\")","v":""},{"$f":"IF(AND(A18<>\"\",Deliverables!F19<>\"\"),Deliverables!F19,\"\")","v":""},{"$f":"IF(AND(A18<>\"\",Deliverables!G19<>\"\"),Deliverables!G19,\"\")","v":""},{"$f":"IF(AND(A18<>\"\",Deliverables!H19<>\"\"),Deliverables!H19,\"\")","v":""},{"$f":"IF(AND(A18<>\"\",Deliverables!I19<>\"\"),Deliverables!I19,\"\")","v":""},{"$f":"IF(AND(A18<>\"\",Deliverables!J19<>\"\"),Deliverables!J19,\"\")","v":""},{"$f":"IF(AND(A18<>\"\",Deliverables!K19<>\"\"),Deliverables!K19,\"\")","v":""},{"$f":"IF(AND(A18<>\"\",Deliverables!L19<>\"\"),Deliverables!L19,\"\")","v":""}]
[{"$f":"IF(Deliverables!B20<>\"\",Deliverables!B20,\"\")","v":""},{"$f":"IF(A19<>\"\",Deliverables!C20,\"\")","v":""},{"$f":"IF(A19<>\"\",Deliverables!D20,\"\")","v":""},{"$f":"IF(AND(A19<>\"\",Deliverables!E20<>\"\"),Deliverables!E20,\"\")","v":""},{"$f":"IF(AND(A19<>\"\",Deliverables!F20<>\"\"),Deliverables!F20,\"\")","v":""},{"$f":"IF(AND(A19<>\"\",Deliverables!G20<>\"\"),Deliverables!G20,\"\")","v":""},{"$f":"IF(AND(A19<>\"\",Deliverables!H20<>\"\"),Deliverables!H20,\"\")","v":""},{"$f":"IF(AND(A19<>\"\",Deliverables!I20<>\"\"),Deliverables!I20,\"\")","v":""},{"$f":"IF(AND(A19<>\"\",Deliverables!J20<>\"\"),Deliverables!J20,\"\")","v":""},{"$f":"IF(AND(A19<>\"\",Deliverables!K20<>\"\"),Deliverables!K20,\"\")","v":""},{"$f":"IF(AND(A19<>\"\",Deliverables!L20<>\"\"),Deliverables!L20,\"\")","v":""}]
[{"$f":"IF(Deliverables!B21<>\"\",Deliverables!B21,\"\")","v":""},{"$f":"IF(A20<>\"\",Deliverables!C21,\"\")","v":""},{"$f":"IF(A20<>\"\",Deliverables!D21,\"\")","v":""},{"$f":"IF(AND(A20<>\"\",Deliverables!E21<>\"\"),Deliverables!E21,\"\")","v":""},{"$f":"IF(AND(A20<>\"\",Deliverables!F21<>\"\"),Deliverables!F21,\"\")","v":""},{"$f":"IF(AND(A20<>\"\",Deliverables!G21<>\"\"),Deliverables!G21,\"\")","v":""},{"$f":"IF(AND(A20<>\"\",Deliverables!H21<>\"\"),Deliverables!H21,\"\")","v":""},{"$f":"IF(AND(A20<>\"\",Deliverables!I21<>\"\"),Deliverables!I21,\"\")","v":""},{"$f":"IF(AND(A20<>\"\",Deliverables!J21<>\"\"),Deliverables!J21,\"\")","v":""},{"$f":"IF(AND(A20<>\"\",Deliverables!K21<>\"\"),Deliverables!K21,\"\")","v":""},{"$f":"IF(AND(A20<>\"\",Deliverables!L21<>\"\"),Deliverables!L21,\"\")","v":""}]
[{"$f":"IF(Deliverables!B22<>\"\",Deliverables!B22,\"\")","v":""},{"$f":"IF(A21<>\"\",Deliverables!C22,\"\")","v":""},{"$f":"IF(A21<>\"\",Deliverables!D22,\"\")","v":""},{"$f":"IF(AND(A21<>\"\",Deliverables!E22<>\"\"),Deliverables!E22,\"\")","v":""},{"$f":"IF(AND(A21<>\"\",Deliverables!F22<>\"\"),Deliverables!F22,\"\")","v":""},{"$f":"IF(AND(A21<>\"\",Deliverables!G22<>\"\"),Deliverables!G22,\"\")","v":""},{"$f":"IF(AND(A21<>\"\",Deliverables!H22<>\"\"),Deliverables!H22,\"\")","v":""},{"$f":"IF(AND(A21<>\"\",Deliverables!I22<>\"\"),Deliverables!I22,\"\")","v":""},{"$f":"IF(AND(A21<>\"\",Deliverables!J22<>\"\"),Deliverables!J22,\"\")","v":""},{"$f":"IF(AND(A21<>\"\",Deliverables!K22<>\"\"),Deliverables!K22,\"\")","v":""},{"$f":"IF(AND(A21<>\"\",Deliverables!L22<>\"\"),Deliverables!L22,\"\")","v":""}]
[{"$f":"IF(Deliverables!B23<>\"\",Deliverables!B23,\"\")","v":""},{"$f":"IF(A22<>\"\",Deliverables!C23,\"\")","v":""},{"$f":"IF(A22<>\"\",Deliverables!D23,\"\")","v":""},{"$f":"IF(AND(A22<>\"\",Deliverables!E23<>\"\"),Deliverables!E23,\"\")","v":""},{"$f":"IF(AND(A22<>\"\",Deliverables!F23<>\"\"),Deliverables!F23,\"\")","v":""},{"$f":"IF(AND(A22<>\"\",Deliverables!G23<>\"\"),Deliverables!G23,\"\")","v":""},{"$f":"IF(AND(A22<>\"\",Deliverables!H23<>\"\"),Deliverables!H23,\"\")","v":""},{"$f":"IF(AND(A22<>\"\",Deliverables!I23<>\"\"),Deliverables!I23,\"\")","v":""},{"$f":"IF(AND(A22<>\"\",Deliverables!J23<>\"\"),Deliverables!J23,\"\")","v":""},{"$f":"IF(AND(A22<>\"\",Deliverables!K23<>\"\"),Deliverables!K23,\"\")","v":""},{"$f":"IF(AND(A22<>\"\",Deliverables!L23<>\"\"),Deliverables!L23,\"\")","v":""}]
[{"$f":"IF(Deliverables!B24<>\"\",Deliverables!B24,\"\")","v":""},{"$f":"IF(A23<>\"\",Deliverables!C24,\"\")","v":""},{"$f":"IF(A23<>\"\",Deliverables!D24,\"\")","v":""},{"$f":"IF(AND(A23<>\"\",Deliverables!E24<>\"\"),Deliverables!E24,\"\")","v":""},{"$f":"IF(AND(A23<>\"\",Deliverables!F24<>\"\"),Deliverables!F24,\"\")","v":""},{"$f":"IF(AND(A23<>\"\",Deliverables!G24<>\"\"),Deliverables!G24,\"\")","v":""},{"$f":"IF(AND(A23<>\"\",Deliverables!H24<>\"\"),Deliverables!H24,\"\")","v":""},{"$f":"IF(AND(A23<>\"\",Deliverables!I24<>\"\"),Deliverables!I24,\"\")","v":""},{"$f":"IF(AND(A23<>\"\",Deliverables!J24<>\"\"),Deliverables!J24,\"\")","v":""},{"$f":"IF(AND(A23<>\"\",Deliverables!K24<>\"\"),Deliverables!K24,\"\")","v":""},{"$f":"IF(AND(A23<>\"\",Deliverables!L24<>\"\"),Deliverables!L24,\"\")","v":""}]
[{"$f":"IF(Deliverables!B25<>\"\",Deliverables!B25,\"\")","v":""},{"$f":"IF(A24<>\"\",Deliverables!C25,\"\")","v":""},{"$f":"IF(A24<>\"\",Deliverables!D25,\"\")","v":""},{"$f":"IF(AND(A24<>\"\",Deliverables!E25<>\"\"),Deliverables!E25,\"\")","v":""},{"$f":"IF(AND(A24<>\"\",Deliverables!F25<>\"\"),Deliverables!F25,\"\")","v":""},{"$f":"IF(AND(A24<>\"\",Deliverables!G25<>\"\"),Deliverables!G25,\"\")","v":""},{"$f":"IF(AND(A24<>\"\",Deliverables!H25<>\"\"),Deliverables!H25,\"\")","v":""},{"$f":"IF(AND(A24<>\"\",Deliverables!I25<>\"\"),Deliverables!I25,\"\")","v":""},{"$f":"IF(AND(A24<>\"\",Deliverables!J25<>\"\"),Deliverables!J25,\"\")","v":""},{"$f":"IF(AND(A24<>\"\",Deliverables!K25<>\"\"),Deliverables!K25,\"\")","v":""},{"$f":"IF(AND(A24<>\"\",Deliverables!L25<>\"\"),Deliverables!L25,\"\")","v":""}]
[{"$f":"IF(Deliverables!B26<>\"\",Deliverables!B26,\"\")","v":""},{"$f":"IF(A25<>\"\",Deliverables!C26,\"\")","v":""},{"$f":"IF(A25<>\"\",Deliverables!D26,\"\")","v":""},{"$f":"IF(AND(A25<>\"\",Deliverables!E26<>\"\"),Deliverables!E26,\"\")","v":""},{"$f":"IF(AND(A25<>\"\",Deliverables!F26<>\"\"),Deliverables!F26,\"\")","v":""},{"$f":"IF(AND(A25<>\"\",Deliverables!G26<>\"\"),Deliverables!G26,\"\")","v":""},{"$f":"IF(AND(A25<>\"\",Deliverables!H26<>\"\"),Deliverables!H26,\"\")","v":""},{"$f":"IF(AND(A25<>\"\",Deliverables!I26<>\"\"),Deliverables!I26,\"\")","v":""},{"$f":"IF(AND(A25<>\"\",Deliverables!J26<>\"\"),Deliverables!J26,\"\")","v":""},{"$f":"IF(AND(A25<>\"\",Deliverables!K26<>\"\"),Deliverables!K26,\"\")","v":""},{"$f":"IF(AND(A25<>\"\",Deliverables!L26<>\"\"),Deliverables!L26,\"\")","v":""}]
[{"$f":"IF(Deliverables!B27<>\"\",Deliverables!B27,\"\")","v":""},{"$f":"IF(A26<>\"\",Deliverables!C27,\"\")","v":""},{"$f":"IF(A26<>\"\",Deliverables!D27,\"\")","v":""},{"$f":"IF(AND(A26<>\"\",Deliverables!E27<>\"\"),Deliverables!E27,\"\")","v":""},{"$f":"IF(AND(A26<>\"\",Deliverables!F27<>\"\"),Deliverables!F27,\"\")","v":""},{"$f":"IF(AND(A26<>\"\",Deliverables!G27<>\"\"),Deliverables!G27,\"\")","v":""},{"$f":"IF(AND(A26<>\"\",Deliverables!H27<>\"\"),Deliverables!H27,\"\")","v":""},{"$f":"IF(AND(A26<>\"\",Deliverables!I27<>\"\"),Deliverables!I27,\"\")","v":""},{"$f":"IF(AND(A26<>\"\",Deliverables!J27<>\"\"),Deliverables!J27,\"\")","v":""},{"$f":"IF(AND(A26<>\"\",Deliverables!K27<>\"\"),Deliverables!K27,\"\")","v":""},{"$f":"IF(AND(A26<>\"\",Deliverables!L27<>\"\"),Deliverables!L27,\"\")","v":""}]
[{"$f":"IF(Deliverables!B28<>\"\",Deliverables!B28,\"\")","v":""},{"$f":"IF(A27<>\"\",Deliverables!C28,\"\")","v":""},{"$f":"IF(A27<>\"\",Deliverables!D28,\"\")","v":""},{"$f":"IF(AND(A27<>\"\",Deliverables!E28<>\"\"),Deliverables!E28,\"\")","v":""},{"$f":"IF(AND(A27<>\"\",Deliverables!F28<>\"\"),Deliverables!F28,\"\")","v":""},{"$f":"IF(AND(A27<>\"\",Deliverables!G28<>\"\"),Deliverables!G28,\"\")","v":""},{"$f":"IF(AND(A27<>\"\",Deliverables!H28<>\"\"),Deliverables!H28,\"\")","v":""},{"$f":"IF(AND(A27<>\"\",Deliverables!I28<>\"\"),Deliverables!I28,\"\")","v":""},{"$f":"IF(AND(A27<>\"\",Deliverables!J28<>\"\"),Deliverables!J28,\"\")","v":""},{"$f":"IF(AND(A27<>\"\",Deliverables!K28<>\"\"),Deliverables!K28,\"\")","v":""},{"$f":"IF(AND(A27<>\"\",Deliverables!L28<>\"\"),Deliverables!L28,\"\")","v":""}]
[]
["Engineering Documents",null,"Table 2 of 5"]
["ID","TITLE","ACRONYM",{"$f":"D2","v":"RR"},{"$f":"E2","v":"PDR"},"CDR","TRR","QAR","IOCR","DCCR","FR"]
[{"$f":"IF(Deliverables!B30<>\"\",Deliverables!B30,\"\")","v":"S.EN01"},{"$f":"IF(AND(A31<>\"\",Deliverables!C30<>\"\"),Deliverables!C30,\"\")","v":"Engineering Document #1"},{"$f":"IF(AND(A31<>\"\",Deliverables!D30<>\"\"),Deliverables!D30,\"\")","v":"ACR#1"},{"$f":"IF(AND(A31<>\"\",Deliverables!E30<>\"\"),Deliverables!E30,\"\")","v":"N"},{"$f":"IF(AND(A31<>\"\",Deliverables!F30<>\"\"),Deliverables!F30,\"\")","v":"U"},{"$f":"IF(AND(A31<>\"\",Deliverables!G30<>\"\"),Deliverables!G30,\"\")","v":"U"},{"$f":"IF(AND(A31<>\"\",Deliverables!H30<>\"\"),Deliverables!H30,\"\")","v":"U"},{"$f":"IF(AND(A31<>\"\",Deliverables!I30<>\"\"),Deliverables!I30,\"\")","v":"U"},{"$f":"IF(AND(A31<>\"\",Deliverables!J30<>\"\"),Deliverables!J30,\"\")","v":"U"},{"$f":"IF(AND(A31<>\"\",Deliverables!K30<>\"\"),Deliverables!K30,\"\")","v":"U"},{"$f":"IF(AND(A31<>\"\",Deliverables!L30<>\"\"),Deliverables!L30,\"\")","v":"U"}]
[{"$f":"IF(Deliverables!B31<>\"\",Deliverables!B31,\"\")","v":"S.EN02"},{"$f":"IF(AND(A32<>\"\",Deliverables!C31<>\"\"),Deliverables!C31,\"\")","v":"Engineering Document #2"},{"$f":"IF(AND(A32<>\"\",Deliverables!D31<>\"\"),Deliverables!D31,\"\")","v":"ACR#2"},{"$f":"IF(AND(A32<>\"\",Deliverables!E31<>\"\"),Deliverables!E31,\"\")","v":"N"},{"$f":"IF(AND(A32<>\"\",Deliverables!F31<>\"\"),Deliverables!F31,\"\")","v":"U"},{"$f":"IF(AND(A32<>\"\",Deliverables!G31<>\"\"),Deliverables!G31,\"\")","v":"U"},{"$f":"IF(AND(A32<>\"\",Deliverables!H31<>\"\"),Deliverables!H31,\"\")","v":"U"},{"$f":"IF(AND(A32<>\"\",Deliverables!I31<>\"\"),Deliverables!I31,\"\")","v":"U"},{"$f":"IF(AND(A32<>\"\",Deliverables!J31<>\"\"),Deliverables!J31,\"\")","v":"U"},{"$f":"IF(AND(A32<>\"\",Deliverables!K31<>\"\"),Deliverables!K31,\"\")","v":"U"},{"$f":"IF(AND(A32<>\"\",Deliverables!L31<>\"\"),Deliverables!L31,\"\")","v":"U"}]
[{"$f":"IF(Deliverables!B32<>\"\",Deliverables!B32,\"\")","v":"S.EN03"},{"$f":"IF(AND(A33<>\"\",Deliverables!C32<>\"\"),Deliverables!C32,\"\")","v":"Engineering Document #3"},{"$f":"IF(AND(A33<>\"\",Deliverables!D32<>\"\"),Deliverables!D32,\"\")","v":"ACR#3"},{"$f":"IF(AND(A33<>\"\",Deliverables!E32<>\"\"),Deliverables!E32,\"\")","v":""},{"$f":"IF(AND(A33<>\"\",Deliverables!F32<>\"\"),Deliverables!F32,\"\")","v":""},{"$f":"IF(AND(A33<>\"\",Deliverables!G32<>\"\"),Deliverables!G32,\"\")","v":"N"},{"$f":"IF(AND(A33<>\"\",Deliverables!H32<>\"\"),Deliverables!H32,\"\")","v":"U"},{"$f":"IF(AND(A33<>\"\",Deliverables!I32<>\"\"),Deliverables!I32,\"\")","v":"U"},{"$f":"IF(AND(A33<>\"\",Deliverables!J32<>\"\"),Deliverables!J32,\"\")","v":"U"},{"$f":"IF(AND(A33<>\"\",Deliverables!K32<>\"\"),Deliverables!K32,\"\")","v":"C"},{"$f":"IF(AND(A33<>\"\",Deliverables!L32<>\"\"),Deliverables!L32,\"\")","v":"C"}]
[{"$f":"IF(Deliverables!B33<>\"\",Deliverables!B33,\"\")","v":"S.EN04"},{"$f":"IF(AND(A34<>\"\",Deliverables!C33<>\"\"),Deliverables!C33,\"\")","v":"Engineering Document #4"},{"$f":"IF(AND(A34<>\"\",Deliverables!D33<>\"\"),Deliverables!D33,\"\")","v":"ACR#4"},{"$f":"IF(AND(A34<>\"\",Deliverables!E33<>\"\"),Deliverables!E33,\"\")","v":"N"},{"$f":"IF(AND(A34<>\"\",Deliverables!F33<>\"\"),Deliverables!F33,\"\")","v":""},{"$f":"IF(AND(A34<>\"\",Deliverables!G33<>\"\"),Deliverables!G33,\"\")","v":" "},{"$f":"IF(AND(A34<>\"\",Deliverables!H33<>\"\"),Deliverables!H33,\"\")","v":"U"},{"$f":"IF(AND(A34<>\"\",Deliverables!I33<>\"\"),Deliverables!I33,\"\")","v":"U"},{"$f":"IF(AND(A34<>\"\",Deliverables!J33<>\"\"),Deliverables!J33,\"\")","v":"U"},{"$f":"IF(AND(A34<>\"\",Deliverables!K33<>\"\"),Deliverables!K33,\"\")","v":"C"},{"$f":"IF(AND(A34<>\"\",Deliverables!L33<>\"\"),Deliverables!L33,\"\")","v":"C"}]
[{"$f":"IF(Deliverables!B34<>\"\",Deliverables!B34,\"\")","v":"S.EN05"},{"$f":"IF(AND(A35<>\"\",Deliverables!C34<>\"\"),Deliverables!C34,\"\")","v":"Engineering Document #5"},{"$f":"IF(AND(A35<>\"\",Deliverables!D34<>\"\"),Deliverables!D34,\"\")","v":"ACR#5"},{"$f":"IF(AND(A35<>\"\",Deliverables!E34<>\"\"),Deliverables!E34,\"\")","v":""},{"$f":"IF(AND(A35<>\"\",Deliverables!F34<>\"\"),Deliverables!F34,\"\")","v":""},{"$f":"IF(AND(A35<>\"\",Deliverables!G34<>\"\"),Deliverables!G34,\"\")","v":" "},{"$f":"IF(AND(A35<>\"\",Deliverables!H34<>\"\"),Deliverables!H34,\"\")","v":"N"},{"$f":"IF(AND(A35<>\"\",Deliverables!I34<>\"\"),Deliverables!I34,\"\")","v":"U"},{"$f":"IF(AND(A35<>\"\",Deliverables!J34<>\"\"),Deliverables!J34,\"\")","v":"U"},{"$f":"IF(AND(A35<>\"\",Deliverables!K34<>\"\"),Deliverables!K34,\"\")","v":"C"},{"$f":"IF(AND(A35<>\"\",Deliverables!L34<>\"\"),Deliverables!L34,\"\")","v":"C"}]
[{"$f":"IF(Deliverables!B35<>\"\",Deliverables!B35,\"\")","v":""},{"$f":"IF(AND(A36<>\"\",Deliverables!C35<>\"\"),Deliverables!C35,\"\")","v":""},{"$f":"IF(AND(A36<>\"\",Deliverables!D35<>\"\"),Deliverables!D35,\"\")","v":""},{"$f":"IF(AND(A36<>\"\",Deliverables!E35<>\"\"),Deliverables!E35,\"\")","v":""},{"$f":"IF(AND(A36<>\"\",Deliverables!F35<>\"\"),Deliverables!F35,\"\")","v":""},{"$f":"IF(AND(A36<>\"\",Deliverables!G35<>\"\"),Deliverables!G35,\"\")","v":""},{"$f":"IF(AND(A36<>\"\",Deliverables!H35<>\"\"),Deliverables!H35,\"\")","v":""},{"$f":"IF(AND(A36<>\"\",Deliverables!I35<>\"\"),Deliverables!I35,\"\")","v":""},{"$f":"IF(AND(A36<>\"\",Deliverables!J35<>\"\"),Deliverables!J35,\"\")","v":""},{"$f":"IF(AND(A36<>\"\",Deliverables!K35<>\"\"),Deliverables!K35,\"\")","v":""},{"$f":"IF(AND(A36<>\"\",Deliverables!L35<>\"\"),Deliverables!L35,\"\")","v":""}]
[{"$f":"IF(Deliverables!B36<>\"\",Deliverables!B36,\"\")","v":""},{"$f":"IF(AND(A37<>\"\",Deliverables!C36<>\"\"),Deliverables!C36,\"\")","v":""},{"$f":"IF(AND(A37<>\"\",Deliverables!D36<>\"\"),Deliverables!D36,\"\")","v":""},{"$f":"IF(AND(A37<>\"\",Deliverables!E36<>\"\"),Deliverables!E36,\"\")","v":""},{"$f":"IF(AND(A37<>\"\",Deliverables!F36<>\"\"),Deliverables!F36,\"\")","v":""},{"$f":"IF(AND(A37<>\"\",Deliverables!G36<>\"\"),Deliverables!G36,\"\")","v":""},{"$f":"IF(AND(A37<>\"\",Deliverables!H36<>\"\"),Deliverables!H36,\"\")","v":""},{"$f":"IF(AND(A37<>\"\",Deliverables!I36<>\"\"),Deliverables!I36,\"\")","v":""},{"$f":"IF(AND(A37<>\"\",Deliverables!J36<>\"\"),Deliverables!J36,\"\")","v":""},{"$f":"IF(AND(A37<>\"\",Deliverables!K36<>\"\"),Deliverables!K36,\"\")","v":""},{"$f":"IF(AND(A37<>\"\",Deliverables!L36<>\"\"),Deliverables!L36,\"\")","v":""}]
[{"$f":"IF(Deliverables!B37<>\"\",Deliverables!B37,\"\")","v":""},{"$f":"IF(AND(A38<>\"\",Deliverables!C37<>\"\"),Deliverables!C37,\"\")","v":""},{"$f":"IF(AND(A38<>\"\",Deliverables!D37<>\"\"),Deliverables!D37,\"\")","v":""},{"$f":"IF(AND(A38<>\"\",Deliverables!E37<>\"\"),Deliverables!E37,\"\")","v":""},{"$f":"IF(AND(A38<>\"\",Deliverables!F37<>\"\"),Deliverables!F37,\"\")","v":""},{"$f":"IF(AND(A38<>\"\",Deliverables!G37<>\"\"),Deliverables!G37,\"\")","v":""},{"$f":"IF(AND(A38<>\"\",Deliverables!H37<>\"\"),Deliverables!H37,\"\")","v":""},{"$f":"IF(AND(A38<>\"\",Deliverables!I37<>\"\"),Deliverables!I37,\"\")","v":""},{"$f":"IF(AND(A38<>\"\",Deliverables!J37<>\"\"),Deliverables!J37,\"\")","v":""},{"$f":"IF(AND(A38<>\"\",Deliverables!K37<>\"\"),Deliverables!K37,\"\")","v":""},{"$f":"IF(AND(A38<>\"\",Deliverables!L37<>\"\"),Deliverables!L37,\"\")","v":""}]
[{"$f":"IF(Deliverables!B38<>\"\",Deliverables!B38,\"\")","v":""},{"$f":"IF(AND(A39<>\"\",Deliverables!C38<>\"\"),Deliverables!C38,\"\")","v":""},{"$f":"IF(AND(A39<>\"\",Deliverables!D38<>\"\"),Deliverables!D38,\"\")","v":""},{"$f":"IF(AND(A39<>\"\",Deliverables!E38<>\"\"),Deliverables!E38,\"\")","v":""},{"$f":"IF(AND(A39<>\"\",Deliverables!F38<>\"\"),Deliverables!F38,\"\")","v":""},{"$f":"IF(AND(A39<>\"\",Deliverables!G38<>\"\"),Deliverables!G38,\"\")","v":""},{"$f":"IF(AND(A39<>\"\",Deliverables!H38<>\"\"),Deliverables!H38,\"\")","v":""},{"$f":"IF(AND(A39<>\"\",Deliverables!I38<>\"\"),Deliverables!I38,\"\")","v":""},{"$f":"IF(AND(A39<>\"\",Deliverables!J38<>\"\"),Deliverables!J38,\"\")","v":""},{"$f":"IF(AND(A39<>\"\",Deliverables!K38<>\"\"),Deliverables!K38,\"\")","v":""},{"$f":"IF(AND(A39<>\"\",Deliverables!L38<>\"\"),Deliverables!L38,\"\")","v":""}]
[{"$f":"IF(Deliverables!B39<>\"\",Deliverables!B39,\"\")","v":""},{"$f":"IF(AND(A40<>\"\",Deliverables!C39<>\"\"),Deliverables!C39,\"\")","v":""},{"$f":"IF(AND(A40<>\"\",Deliverables!D39<>\"\"),Deliverables!D39,\"\")","v":""},{"$f":"IF(AND(A40<>\"\",Deliverables!E39<>\"\"),Deliverables!E39,\"\")","v":""},{"$f":"IF(AND(A40<>\"\",Deliverables!F39<>\"\"),Deliverables!F39,\"\")","v":""},{"$f":"IF(AND(A40<>\"\",Deliverables!G39<>\"\"),Deliverables!G39,\"\")","v":""},{"$f":"IF(AND(A40<>\"\",Deliverables!H39<>\"\"),Deliverables!H39,\"\")","v":""},{"$f":"IF(AND(A40<>\"\",Deliverables!I39<>\"\"),Deliverables!I39,\"\")","v":""},{"$f":"IF(AND(A40<>\"\",Deliverables!J39<>\"\"),Deliverables!J39,\"\")","v":""},{"$f":"IF(AND(A40<>\"\",Deliverables!K39<>\"\"),Deliverables!K39,\"\")","v":""},{"$f":"IF(AND(A40<>\"\",Deliverables!L39<>\"\"),Deliverables!L39,\"\")","v":""}]
[{"$f":"IF(Deliverables!B40<>\"\",Deliverables!B40,\"\")","v":""},{"$f":"IF(AND(A41<>\"\",Deliverables!C40<>\"\"),Deliverables!C40,\"\")","v":""},{"$f":"IF(AND(A41<>\"\",Deliverables!D40<>\"\"),Deliverables!D40,\"\")","v":""},{"$f":"IF(AND(A41<>\"\",Deliverables!E40<>\"\"),Deliverables!E40,\"\")","v":""},{"$f":"IF(AND(A41<>\"\",Deliverables!F40<>\"\"),Deliverables!F40,\"\")","v":""},{"$f":"IF(AND(A41<>\"\",Deliverables!G40<>\"\"),Deliverables!G40,\"\")","v":""},{"$f":"IF(AND(A41<>\"\",Deliverables!H40<>\"\"),Deliverables!H40,\"\")","v":""},{"$f":"IF(AND(A41<>\"\",Deliverables!I40<>\"\"),Deliverables!I40,\"\")","v":""},{"$f":"IF(AND(A41<>\"\",Deliverables!J40<>\"\"),Deliverables!J40,\"\")","v":""},{"$f":"IF(AND(A41<>\"\",Deliverables!K40<>\"\"),Deliverables!K40,\"\")","v":""},{"$f":"IF(AND(A41<>\"\",Deliverables!L40<>\"\"),Deliverables!L40,\"\")","v":""}]
[{"$f":"IF(Deliverables!B41<>\"\",Deliverables!B41,\"\")","v":""},{"$f":"IF(AND(A42<>\"\",Deliverables!C41<>\"\"),Deliverables!C41,\"\")","v":""},{"$f":"IF(AND(A42<>\"\",Deliverables!D41<>\"\"),Deliverables!D41,\"\")","v":""},{"$f":"IF(AND(A42<>\"\",Deliverables!E41<>\"\"),Deliverables!E41,\"\")","v":""},{"$f":"IF(AND(A42<>\"\",Deliverables!F41<>\"\"),Deliverables!F41,\"\")","v":""},{"$f":"IF(AND(A42<>\"\",Deliverables!G41<>\"\"),Deliverables!G41,\"\")","v":""},{"$f":"IF(AND(A42<>\"\",Deliverables!H41<>\"\"),Deliverables!H41,\"\")","v":""},{"$f":"IF(AND(A42<>\"\",Deliverables!I41<>\"\"),Deliverables!I41,\"\")","v":""},{"$f":"IF(AND(A42<>\"\",Deliverables!J41<>\"\"),Deliverables!J41,\"\")","v":""},{"$f":"IF(AND(A42<>\"\",Deliverables!K41<>\"\"),Deliverables!K41,\"\")","v":""},{"$f":"IF(AND(A42<>\"\",Deliverables!L41<>\"\"),Deliverables!L41,\"\")","v":""}]
[{"$f":"IF(Deliverables!B42<>\"\",Deliverables!B42,\"\")","v":""},{"$f":"IF(AND(A43<>\"\",Deliverables!C42<>\"\"),Deliverables!C42,\"\")","v":""},{"$f":"IF(AND(A43<>\"\",Deliverables!D42<>\"\"),Deliverables!D42,\"\")","v":""},{"$f":"IF(AND(A43<>\"\",Deliverables!E42<>\"\"),Deliverables!E42,\"\")","v":""},{"$f":"IF(AND(A43<>\"\",Deliverables!F42<>\"\"),Deliverables!F42,\"\")","v":""},{"$f":"IF(AND(A43<>\"\",Deliverables!G42<>\"\"),Deliverables!G42,\"\")","v":""},{"$f":"IF(AND(A43<>\"\",Deliverables!H42<>\"\"),Deliverables!H42,\"\")","v":""},{"$f":"IF(AND(A43<>\"\",Deliverables!I42<>\"\"),Deliverables!I42,\"\")","v":""},{"$f":"IF(AND(A43<>\"\",Deliverables!J42<>\"\"),Deliverables!J42,\"\")","v":""},{"$f":"IF(AND(A43<>\"\",Deliverables!K42<>\"\"),Deliverables!K42,\"\")","v":""},{"$f":"IF(AND(A43<>\"\",Deliverables!L42<>\"\"),Deliverables!L42,\"\")","v":""}]
[{"$f":"IF(Deliverables!B43<>\"\",Deliverables!B43,\"\")","v":""},{"$f":"IF(AND(A44<>\"\",Deliverables!C43<>\"\"),Deliverables!C43,\"\")","v":""},{"$f":"IF(AND(A44<>\"\",Deliverables!D43<>\"\"),Deliverables!D43,\"\")","v":""},{"$f":"IF(AND(A44<>\"\",Deliverables!E43<>\"\"),Deliverables!E43,\"\")","v":""},{"$f":"IF(AND(A44<>\"\",Deliverables!F43<>\"\"),Deliverables!F43,\"\")","v":""},{"$f":"IF(AND(A44<>\"\",Deliverables!G43<>\"\"),Deliverables!G43,\"\")","v":""},{"$f":"IF(AND(A44<>\"\",Deliverables!H43<>\"\"),Deliverables!H43,\"\")","v":""},{"$f":"IF(AND(A44<>\"\",Deliverables!I43<>\"\"),Deliverables!I43,\"\")","v":""},{"$f":"IF(AND(A44<>\"\",Deliverables!J43<>\"\"),Deliverables!J43,\"\")","v":""},{"$f":"IF(AND(A44<>\"\",Deliverables!K43<>\"\"),Deliverables!K43,\"\")","v":""},{"$f":"IF(AND(A44<>\"\",Deliverables!L43<>\"\"),Deliverables!L43,\"\")","v":""}]
[{"$f":"IF(Deliverables!B44<>\"\",Deliverables!B44,\"\")","v":""},{"$f":"IF(AND(A45<>\"\",Deliverables!C44<>\"\"),Deliverables!C44,\"\")","v":""},{"$f":"IF(AND(A45<>\"\",Deliverables!D44<>\"\"),Deliverables!D44,\"\")","v":""},{"$f":"IF(AND(A45<>\"\",Deliverables!E44<>\"\"),Deliverables!E44,\"\")","v":""},{"$f":"IF(AND(A45<>\"\",Deliverables!F44<>\"\"),Deliverables!F44,\"\")","v":""},{"$f":"IF(AND(A45<>\"\",Deliverables!G44<>\"\"),Deliverables!G44,\"\")","v":""},{"$f":"IF(AND(A45<>\"\",Deliverables!H44<>\"\"),Deliverables!H44,\"\")","v":""},{"$f":"IF(AND(A45<>\"\",Deliverables!I44<>\"\"),Deliverables!I44,\"\")","v":""},{"$f":"IF(AND(A45<>\"\",Deliverables!J44<>\"\"),Deliverables!J44,\"\")","v":""},{"$f":"IF(AND(A45<>\"\",Deliverables!K44<>\"\"),Deliverables!K44,\"\")","v":""},{"$f":"IF(AND(A45<>\"\",Deliverables!L44<>\"\"),Deliverables!L44,\"\")","v":""}]
[{"$f":"IF(Deliverables!B45<>\"\",Deliverables!B45,\"\")","v":""},{"$f":"IF(AND(A46<>\"\",Deliverables!C45<>\"\"),Deliverables!C45,\"\")","v":""},{"$f":"IF(AND(A46<>\"\",Deliverables!D45<>\"\"),Deliverables!D45,\"\")","v":""},{"$f":"IF(AND(A46<>\"\",Deliverables!E45<>\"\"),Deliverables!E45,\"\")","v":""},{"$f":"IF(AND(A46<>\"\",Deliverables!F45<>\"\"),Deliverables!F45,\"\")","v":""},{"$f":"IF(AND(A46<>\"\",Deliverables!G45<>\"\"),Deliverables!G45,\"\")","v":""},{"$f":"IF(AND(A46<>\"\",Deliverables!H45<>\"\"),Deliverables!H45,\"\")","v":""},{"$f":"IF(AND(A46<>\"\",Deliverables!I45<>\"\"),Deliverables!I45,\"\")","v":""},{"$f":"IF(AND(A46<>\"\",Deliverables!J45<>\"\"),Deliverables!J45,\"\")","v":""},{"$f":"IF(AND(A46<>\"\",Deliverables!K45<>\"\"),Deliverables!K45,\"\")","v":""},{"$f":"IF(AND(A46<>\"\",Deliverables!L45<>\"\"),Deliverables!L45,\"\")","v":""}]
[{"$f":"IF(Deliverables!B46<>\"\",Deliverables!B46,\"\")","v":""},{"$f":"IF(AND(A47<>\"\",Deliverables!C46<>\"\"),Deliverables!C46,\"\")","v":""},{"$f":"IF(AND(A47<>\"\",Deliverables!D46<>\"\"),Deliverables!D46,\"\")","v":""},{"$f":"IF(AND(A47<>\"\",Deliverables!E46<>\"\"),Deliverables!E46,\"\")","v":""},{"$f":"IF(AND(A47<>\"\",Deliverables!F46<>\"\"),Deliverables!F46,\"\")","v":""},{"$f":"IF(AND(A47<>\"\",Deliverables!G46<>\"\"),Deliverables!G46,\"\")","v":""},{"$f":"IF(AND(A47<>\"\",Deliverables!H46<>\"\"),Deliverables!H46,\"\")","v":""},{"$f":"IF(AND(A47<>\"\",Deliverables!I46<>\"\"),Deliverables!I46,\"\")","v":""},{"$f":"IF(AND(A47<>\"\",Deliverables!J46<>\"\"),Deliverables!J46,\"\")","v":""},{"$f":"IF(AND(A47<>\"\",Deliverables!K46<>\"\"),Deliverables!K46,\"\")","v":""},{"$f":"IF(AND(A47<>\"\",Deliverables!L46<>\"\"),Deliverables!L46,\"\")","v":""}]
[{"$f":"IF(Deliverables!B47<>\"\",Deliverables!B47,\"\")","v":""},{"$f":"IF(AND(A48<>\"\",Deliverables!C47<>\"\"),Deliverables!C47,\"\")","v":""},{"$f":"IF(AND(A48<>\"\",Deliverables!D47<>\"\"),Deliverables!D47,\"\")","v":""},{"$f":"IF(AND(A48<>\"\",Deliverables!E47<>\"\"),Deliverables!E47,\"\")","v":""},{"$f":"IF(AND(A48<>\"\",Deliverables!F47<>\"\"),Deliverables!F47,\"\")","v":""},{"$f":"IF(AND(A48<>\"\",Deliverables!G47<>\"\"),Deliverables!G47,\"\")","v":""},{"$f":"IF(AND(A48<>\"\",Deliverables!H47<>\"\"),Deliverables!H47,\"\")","v":""},{"$f":"IF(AND(A48<>\"\",Deliverables!I47<>\"\"),Deliverables!I47,\"\")","v":""},{"$f":"IF(AND(A48<>\"\",Deliverables!J47<>\"\"),Deliverables!J47,\"\")","v":""},{"$f":"IF(AND(A48<>\"\",Deliverables!K47<>\"\"),Deliverables!K47,\"\")","v":""},{"$f":"IF(AND(A48<>\"\",Deliverables!L47<>\"\"),Deliverables!L47,\"\")","v":""}]
[{"$f":"IF(Deliverables!B48<>\"\",Deliverables!B48,\"\")","v":""},{"$f":"IF(AND(A49<>\"\",Deliverables!C48<>\"\"),Deliverables!C48,\"\")","v":""},{"$f":"IF(AND(A49<>\"\",Deliverables!D48<>\"\"),Deliverables!D48,\"\")","v":""},{"$f":"IF(AND(A49<>\"\",Deliverables!E48<>\"\"),Deliverables!E48,\"\")","v":""},{"$f":"IF(AND(A49<>\"\",Deliverables!F48<>\"\"),Deliverables!F48,\"\")","v":""},{"$f":"IF(AND(A49<>\"\",Deliverables!G48<>\"\"),Deliverables!G48,\"\")","v":""},{"$f":"IF(AND(A49<>\"\",Deliverables!H48<>\"\"),Deliverables!H48,\"\")","v":""},{"$f":"IF(AND(A49<>\"\",Deliverables!I48<>\"\"),Deliverables!I48,\"\")","v":""},{"$f":"IF(AND(A49<>\"\",Deliverables!J48<>\"\"),Deliverables!J48,\"\")","v":""},{"$f":"IF(AND(A49<>\"\",Deliverables!K48<>\"\"),Deliverables!K48,\"\")","v":""},{"$f":"IF(AND(A49<>\"\",Deliverables!L48<>\"\"),Deliverables!L48,\"\")","v":""}]
[{"$f":"IF(Deliverables!B49<>\"\",Deliverables!B49,\"\")","v":""},{"$f":"IF(AND(A50<>\"\",Deliverables!C49<>\"\"),Deliverables!C49,\"\")","v":""},{"$f":"IF(AND(A50<>\"\",Deliverables!D49<>\"\"),Deliverables!D49,\"\")","v":""},{"$f":"IF(AND(A50<>\"\",Deliverables!E49<>\"\"),Deliverables!E49,\"\")","v":""},{"$f":"IF(AND(A50<>\"\",Deliverables!F49<>\"\"),Deliverables!F49,\"\")","v":""},{"$f":"IF(AND(A50<>\"\",Deliverables!G49<>\"\"),Deliverables!G49,\"\")","v":""},{"$f":"IF(AND(A50<>\"\",Deliverables!H49<>\"\"),Deliverables!H49,\"\")","v":""},{"$f":"IF(AND(A50<>\"\",Deliverables!I49<>\"\"),Deliverables!I49,\"\")","v":""},{"$f":"IF(AND(A50<>\"\",Deliverables!J49<>\"\"),Deliverables!J49,\"\")","v":""},{"$f":"IF(AND(A50<>\"\",Deliverables!K49<>\"\"),Deliverables!K49,\"\")","v":""},{"$f":"IF(AND(A50<>\"\",Deliverables!L49<>\"\"),Deliverables!L49,\"\")","v":""}]
[{"$f":"IF(Deliverables!B50<>\"\",Deliverables!B50,\"\")","v":""},{"$f":"IF(AND(A51<>\"\",Deliverables!C50<>\"\"),Deliverables!C50,\"\")","v":""},{"$f":"IF(AND(A51<>\"\",Deliverables!D50<>\"\"),Deliverables!D50,\"\")","v":""},{"$f":"IF(AND(A51<>\"\",Deliverables!E50<>\"\"),Deliverables!E50,\"\")","v":""},{"$f":"IF(AND(A51<>\"\",Deliverables!F50<>\"\"),Deliverables!F50,\"\")","v":""},{"$f":"IF(AND(A51<>\"\",Deliverables!G50<>\"\"),Deliverables!G50,\"\")","v":""},{"$f":"IF(AND(A51<>\"\",Deliverables!H50<>\"\"),Deliverables!H50,\"\")","v":""},{"$f":"IF(AND(A51<>\"\",Deliverables!I50<>\"\"),Deliverables!I50,\"\")","v":""},{"$f":"IF(AND(A51<>\"\",Deliverables!J50<>\"\"),Deliverables!J50,\"\")","v":""},{"$f":"IF(AND(A51<>\"\",Deliverables!K50<>\"\"),Deliverables!K50,\"\")","v":""},{"$f":"IF(AND(A51<>\"\",Deliverables!L50<>\"\"),Deliverables!L50,\"\")","v":""}]
[{"$f":"IF(Deliverables!B51<>\"\",Deliverables!B51,\"\")","v":""},{"$f":"IF(AND(A52<>\"\",Deliverables!C51<>\"\"),Deliverables!C51,\"\")","v":""},{"$f":"IF(AND(A52<>\"\",Deliverables!D51<>\"\"),Deliverables!D51,\"\")","v":""},{"$f":"IF(AND(A52<>\"\",Deliverables!E51<>\"\"),Deliverables!E51,\"\")","v":""},{"$f":"IF(AND(A52<>\"\",Deliverables!F51<>\"\"),Deliverables!F51,\"\")","v":""},{"$f":"IF(AND(A52<>\"\",Deliverables!G51<>\"\"),Deliverables!G51,\"\")","v":""},{"$f":"IF(AND(A52<>\"\",Deliverables!H51<>\"\"),Deliverables!H51,\"\")","v":""},{"$f":"IF(AND(A52<>\"\",Deliverables!I51<>\"\"),Deliverables!I51,\"\")","v":""},{"$f":"IF(AND(A52<>\"\",Deliverables!J51<>\"\"),Deliverables!J51,\"\")","v":""},{"$f":"IF(AND(A52<>\"\",Deliverables!K51<>\"\"),Deliverables!K51,\"\")","v":""},{"$f":"IF(AND(A52<>\"\",Deliverables!L51<>\"\"),Deliverables!L51,\"\")","v":""}]
[{"$f":"IF(Deliverables!B52<>\"\",Deliverables!B52,\"\")","v":""},{"$f":"IF(AND(A53<>\"\",Deliverables!C52<>\"\"),Deliverables!C52,\"\")","v":""},{"$f":"IF(AND(A53<>\"\",Deliverables!D52<>\"\"),Deliverables!D52,\"\")","v":""},{"$f":"IF(AND(A53<>\"\",Deliverables!E52<>\"\"),Deliverables!E52,\"\")","v":""},{"$f":"IF(AND(A53<>\"\",Deliverables!F52<>\"\"),Deliverables!F52,\"\")","v":""},{"$f":"IF(AND(A53<>\"\",Deliverables!G52<>\"\"),Deliverables!G52,\"\")","v":""},{"$f":"IF(AND(A53<>\"\",Deliverables!H52<>\"\"),Deliverables!H52,\"\")","v":""},{"$f":"IF(AND(A53<>\"\",Deliverables!I52<>\"\"),Deliverables!I52,\"\")","v":""},{"$f":"IF(AND(A53<>\"\",Deliverables!J52<>\"\"),Deliverables!J52,\"\")","v":""},{"$f":"IF(AND(A53<>\"\",Deliverables!K52<>\"\"),Deliverables!K52,\"\")","v":""},{"$f":"IF(AND(A53<>\"\",Deliverables!L52<>\"\"),Deliverables!L52,\"\")","v":""}]
[{"$f":"IF(Deliverables!B53<>\"\",Deliverables!B53,\"\")","v":""},{"$f":"IF(AND(A54<>\"\",Deliverables!C53<>\"\"),Deliverables!C53,\"\")","v":""},{"$f":"IF(AND(A54<>\"\",Deliverables!D53<>\"\"),Deliverables!D53,\"\")","v":""},{"$f":"IF(AND(A54<>\"\",Deliverables!E53<>\"\"),Deliverables!E53,\"\")","v":""},{"$f":"IF(AND(A54<>\"\",Deliverables!F53<>\"\"),Deliverables!F53,\"\")","v":""},{"$f":"IF(AND(A54<>\"\",Deliverables!G53<>\"\"),Deliverables!G53,\"\")","v":""},{"$f":"IF(AND(A54<>\"\",Deliverables!H53<>\"\"),Deliverables!H53,\"\")","v":""},{"$f":"IF(AND(A54<>\"\",Deliverables!I53<>\"\"),Deliverables!I53,\"\")","v":""},{"$f":"IF(AND(A54<>\"\",Deliverables!J53<>\"\"),Deliverables!J53,\"\")","v":""},{"$f":"IF(AND(A54<>\"\",Deliverables!K53<>\"\"),Deliverables!K53,\"\")","v":""},{"$f":"IF(AND(A54<>\"\",Deliverables!L53<>\"\"),Deliverables!L53,\"\")","v":""}]
[{"$f":"IF(Deliverables!B54<>\"\",Deliverables!B54,\"\")","v":""},{"$f":"IF(AND(A55<>\"\",Deliverables!C54<>\"\"),Deliverables!C54,\"\")","v":""},{"$f":"IF(AND(A55<>\"\",Deliverables!D54<>\"\"),Deliverables!D54,\"\")","v":""},{"$f":"IF(AND(A55<>\"\",Deliverables!E54<>\"\"),Deliverables!E54,\"\")","v":""},{"$f":"IF(AND(A55<>\"\",Deliverables!F54<>\"\"),Deliverables!F54,\"\")","v":""},{"$f":"IF(AND(A55<>\"\",Deliverables!G54<>\"\"),Deliverables!G54,\"\")","v":""},{"$f":"IF(AND(A55<>\"\",Deliverables!H54<>\"\"),Deliverables!H54,\"\")","v":""},{"$f":"IF(AND(A55<>\"\",Deliverables!I54<>\"\"),Deliverables!I54,\"\")","v":""},{"$f":"IF(AND(A55<>\"\",Deliverables!J54<>\"\"),Deliverables!J54,\"\")","v":""},{"$f":"IF(AND(A55<>\"\",Deliverables!K54<>\"\"),Deliverables!K54,\"\")","v":""},{"$f":"IF(AND(A55<>\"\",Deliverables!L54<>\"\"),Deliverables!L54,\"\")","v":""}]
[{"$f":"IF(Deliverables!B55<>\"\",Deliverables!B55,\"\")","v":""},{"$f":"IF(AND(A56<>\"\",Deliverables!C55<>\"\"),Deliverables!C55,\"\")","v":""},{"$f":"IF(AND(A56<>\"\",Deliverables!D55<>\"\"),Deliverables!D55,\"\")","v":""},{"$f":"IF(AND(A56<>\"\",Deliverables!E55<>\"\"),Deliverables!E55,\"\")","v":""},{"$f":"IF(AND(A56<>\"\",Deliverables!F55<>\"\"),Deliverables!F55,\"\")","v":""},{"$f":"IF(AND(A56<>\"\",Deliverables!G55<>\"\"),Deliverables!G55,\"\")","v":""},{"$f":"IF(AND(A56<>\"\",Deliverables!H55<>\"\"),Deliverables!H55,\"\")","v":""},{"$f":"IF(AND(A56<>\"\",Deliverables!I55<>\"\"),Deliverables!I55,\"\")","v":""},{"$f":"IF(AND(A56<>\"\",Deliverables!J55<>\"\"),Deliverables!J55,\"\")","v":""},{"$f":"IF(AND(A56<>\"\",Deliverables!K55<>\"\"),Deliverables!K55,\"\")","v":""},{"$f":"IF(AND(A56<>\"\",Deliverables!L55<>\"\"),Deliverables!L55,\"\")","v":""}]
[{"$f":"IF(Deliverables!B56<>\"\",Deliverables!B56,\"\")","v":""},{"$f":"IF(AND(A57<>\"\",Deliverables!C56<>\"\"),Deliverables!C56,\"\")","v":""},{"$f":"IF(AND(A57<>\"\",Deliverables!D56<>\"\"),Deliverables!D56,\"\")","v":""},{"$f":"IF(AND(A57<>\"\",Deliverables!E56<>\"\"),Deliverables!E56,\"\")","v":""},{"$f":"IF(AND(A57<>\"\",Deliverables!F56<>\"\"),Deliverables!F56,\"\")","v":""},{"$f":"IF(AND(A57<>\"\",Deliverables!G56<>\"\"),Deliverables!G56,\"\")","v":""},{"$f":"IF(AND(A57<>\"\",Deliverables!H56<>\"\"),Deliverables!H56,\"\")","v":""},{"$f":"IF(AND(A57<>\"\",Deliverables!I56<>\"\"),Deliverables!I56,\"\")","v":""},{"$f":"IF(AND(A57<>\"\",Deliverables!J56<>\"\"),Deliverables!J56,\"\")","v":""},{"$f":"IF(AND(A57<>\"\",Deliverables!K56<>\"\"),Deliverables!K56,\"\")","v":""},{"$f":"IF(AND(A57<>\"\",Deliverables!L56<>\"\"),Deliverables!L56,\"\")","v":""}]
[{"$f":"IF(Deliverables!B57<>\"\",Deliverables!B57,\"\")","v":""},{"$f":"IF(AND(A58<>\"\",Deliverables!C57<>\"\"),Deliverables!C57,\"\")","v":""},{"$f":"IF(AND(A58<>\"\",Deliverables!D57<>\"\"),Deliverables!D57,\"\")","v":""},{"$f":"IF(AND(A58<>\"\",Deliverables!E57<>\"\"),Deliverables!E57,\"\")","v":""},{"$f":"IF(AND(A58<>\"\",Deliverables!F57<>\"\"),Deliverables!F57,\"\")","v":""},{"$f":"IF(AND(A58<>\"\",Deliverables!G57<>\"\"),Deliverables!G57,\"\")","v":""},{"$f":"IF(AND(A58<>\"\",Deliverables!H57<>\"\"),Deliverables!H57,\"\")","v":""},{"$f":"IF(AND(A58<>\"\",Deliverables!I57<>\"\"),Deliverables!I57,\"\")","v":""},{"$f":"IF(AND(A58<>\"\",Deliverables!J57<>\"\"),Deliverables!J57,\"\")","v":""},{"$f":"IF(AND(A58<>\"\",Deliverables!K57<>\"\"),Deliverables!K57,\"\")","v":""},{"$f":"IF(AND(A58<>\"\",Deliverables!L57<>\"\"),Deliverables!L57,\"\")","v":""}]
[{"$f":"IF(Deliverables!B58<>\"\",Deliverables!B58,\"\")","v":""},{"$f":"IF(AND(A59<>\"\",Deliverables!C58<>\"\"),Deliverables!C58,\"\")","v":""},{"$f":"IF(AND(A59<>\"\",Deliverables!D58<>\"\"),Deliverables!D58,\"\")","v":""},{"$f":"IF(AND(A59<>\"\",Deliverables!E58<>\"\"),Deliverables!E58,\"\")","v":""},{"$f":"IF(AND(A59<>\"\",Deliverables!F58<>\"\"),Deliverables!F58,\"\")","v":""},{"$f":"IF(AND(A59<>\"\",Deliverables!G58<>\"\"),Deliverables!G58,\"\")","v":""},{"$f":"IF(AND(A59<>\"\",Deliverables!H58<>\"\"),Deliverables!H58,\"\")","v":""},{"$f":"IF(AND(A59<>\"\",Deliverables!I58<>\"\"),Deliverables!I58,\"\")","v":""},{"$f":"IF(AND(A59<>\"\",Deliverables!J58<>\"\"),Deliverables!J58,\"\")","v":""},{"$f":"IF(AND(A59<>\"\",Deliverables!K58<>\"\"),Deliverables!K58,\"\")","v":""},{"$f":"IF(AND(A59<>\"\",Deliverables!L58<>\"\"),Deliverables!L58,\"\")","v":""}]
[{"$f":"IF(Deliverables!B59<>\"\",Deliverables!B59,\"\")","v":""},{"$f":"IF(AND(A60<>\"\",Deliverables!C59<>\"\"),Deliverables!C59,\"\")","v":""},{"$f":"IF(AND(A60<>\"\",Deliverables!D59<>\"\"),Deliverables!D59,\"\")","v":""},{"$f":"IF(AND(A60<>\"\",Deliverables!E59<>\"\"),Deliverables!E59,\"\")","v":""},{"$f":"IF(AND(A60<>\"\",Deliverables!F59<>\"\"),Deliverables!F59,\"\")","v":""},{"$f":"IF(AND(A60<>\"\",Deliverables!G59<>\"\"),Deliverables!G59,\"\")","v":""},{"$f":"IF(AND(A60<>\"\",Deliverables!H59<>\"\"),Deliverables!H59,\"\")","v":""},{"$f":"IF(AND(A60<>\"\",Deliverables!I59<>\"\"),Deliverables!I59,\"\")","v":""},{"$f":"IF(AND(A60<>\"\",Deliverables!J59<>\"\"),Deliverables!J59,\"\")","v":""},{"$f":"IF(AND(A60<>\"\",Deliverables!K59<>\"\"),Deliverables!K59,\"\")","v":""},{"$f":"IF(AND(A60<>\"\",Deliverables!L59<>\"\"),Deliverables!L59,\"\")","v":""}]
[{"$f":"IF(Deliverables!B60<>\"\",Deliverables!B60,\"\")","v":""},{"$f":"IF(AND(A61<>\"\",Deliverables!C60<>\"\"),Deliverables!C60,\"\")","v":""},{"$f":"IF(AND(A61<>\"\",Deliverables!D60<>\"\"),Deliverables!D60,\"\")","v":""},{"$f":"IF(AND(A61<>\"\",Deliverables!E60<>\"\"),Deliverables!E60,\"\")","v":""},{"$f":"IF(AND(A61<>\"\",Deliverables!F60<>\"\"),Deliverables!F60,\"\")","v":""},{"$f":"IF(AND(A61<>\"\",Deliverables!G60<>\"\"),Deliverables!G60,\"\")","v":""},{"$f":"IF(AND(A61<>\"\",Deliverables!H60<>\"\"),Deliverables!H60,\"\")","v":""},{"$f":"IF(AND(A61<>\"\",Deliverables!I60<>\"\"),Deliverables!I60,\"\")","v":""},{"$f":"IF(AND(A61<>\"\",Deliverables!J60<>\"\"),Deliverables!J60,\"\")","v":""},{"$f":"IF(AND(A61<>\"\",Deliverables!K60<>\"\"),Deliverables!K60,\"\")","v":""},{"$f":"IF(AND(A61<>\"\",Deliverables!L60<>\"\"),Deliverables!L60,\"\")","v":""}]
[{"$f":"IF(Deliverables!B61<>\"\",Deliverables!B61,\"\")","v":""},{"$f":"IF(AND(A62<>\"\",Deliverables!C61<>\"\"),Deliverables!C61,\"\")","v":""},{"$f":"IF(AND(A62<>\"\",Deliverables!D61<>\"\"),Deliverables!D61,\"\")","v":""},{"$f":"IF(AND(A62<>\"\",Deliverables!E61<>\"\"),Deliverables!E61,\"\")","v":""},{"$f":"IF(AND(A62<>\"\",Deliverables!F61<>\"\"),Deliverables!F61,\"\")","v":""},{"$f":"IF(AND(A62<>\"\",Deliverables!G61<>\"\"),Deliverables!G61,\"\")","v":""},{"$f":"IF(AND(A62<>\"\",Deliverables!H61<>\"\"),Deliverables!H61,\"\")","v":""},{"$f":"IF(AND(A62<>\"\",Deliverables!I61<>\"\"),Deliverables!I61,\"\")","v":""},{"$f":"IF(AND(A62<>\"\",Deliverables!J61<>\"\"),Deliverables!J61,\"\")","v":""},{"$f":"IF(AND(A62<>\"\",Deliverables!K61<>\"\"),Deliverables!K61,\"\")","v":""},{"$f":"IF(AND(A62<>\"\",Deliverables!L61<>\"\"),Deliverables!L61,\"\")","v":""}]
[{"$f":"IF(Deliverables!B62<>\"\",Deliverables!B62,\"\")","v":""},{"$f":"IF(AND(A63<>\"\",Deliverables!C62<>\"\"),Deliverables!C62,\"\")","v":""},{"$f":"IF(AND(A63<>\"\",Deliverables!D62<>\"\"),Deliverables!D62,\"\")","v":""},{"$f":"IF(AND(A63<>\"\",Deliverables!E62<>\"\"),Deliverables!E62,\"\")","v":""},{"$f":"IF(AND(A63<>\"\",Deliverables!F62<>\"\"),Deliverables!F62,\"\")","v":""},{"$f":"IF(AND(A63<>\"\",Deliverables!G62<>\"\"),Deliverables!G62,\"\")","v":""},{"$f":"IF(AND(A63<>\"\",Deliverables!H62<>\"\"),Deliverables!H62,\"\")","v":""},{"$f":"IF(AND(A63<>\"\",Deliverables!I62<>\"\"),Deliverables!I62,\"\")","v":""},{"$f":"IF(AND(A63<>\"\",Deliverables!J62<>\"\"),Deliverables!J62,\"\")","v":""},{"$f":"IF(AND(A63<>\"\",Deliverables!K62<>\"\"),Deliverables!K62,\"\")","v":""},{"$f":"IF(AND(A63<>\"\",Deliverables!L62<>\"\"),Deliverables!L62,\"\")","v":""}]
[{"$f":"IF(Deliverables!B63<>\"\",Deliverables!B63,\"\")","v":""},{"$f":"IF(AND(A64<>\"\",Deliverables!C63<>\"\"),Deliverables!C63,\"\")","v":""},{"$f":"IF(AND(A64<>\"\",Deliverables!D63<>\"\"),Deliverables!D63,\"\")","v":""},{"$f":"IF(AND(A64<>\"\",Deliverables!E63<>\"\"),Deliverables!E63,\"\")","v":""},{"$f":"IF(AND(A64<>\"\",Deliverables!F63<>\"\"),Deliverables!F63,\"\")","v":""},{"$f":"IF(AND(A64<>\"\",Deliverables!G63<>\"\"),Deliverables!G63,\"\")","v":""},{"$f":"IF(AND(A64<>\"\",Deliverables!H63<>\"\"),Deliverables!H63,\"\")","v":""},{"$f":"IF(AND(A64<>\"\",Deliverables!I63<>\"\"),Deliverables!I63,\"\")","v":""},{"$f":"IF(AND(A64<>\"\",Deliverables!J63<>\"\"),Deliverables!J63,\"\")","v":""},{"$f":"IF(AND(A64<>\"\",Deliverables!K63<>\"\"),Deliverables!K63,\"\")","v":""},{"$f":"IF(AND(A64<>\"\",Deliverables!L63<>\"\"),Deliverables!L63,\"\")","v":""}]
[{"$f":"IF(Deliverables!B64<>\"\",Deliverables!B64,\"\")","v":""},{"$f":"IF(AND(A65<>\"\",Deliverables!C64<>\"\"),Deliverables!C64,\"\")","v":""},{"$f":"IF(AND(A65<>\"\",Deliverables!D64<>\"\"),Deliverables!D64,\"\")","v":""},{"$f":"IF(AND(A65<>\"\",Deliverables!E64<>\"\"),Deliverables!E64,\"\")","v":""},{"$f":"IF(AND(A65<>\"\",Deliverables!F64<>\"\"),Deliverables!F64,\"\")","v":""},{"$f":"IF(AND(A65<>\"\",Deliverables!G64<>\"\"),Deliverables!G64,\"\")","v":""},{"$f":"IF(AND(A65<>\"\",Deliverables!H64<>\"\"),Deliverables!H64,\"\")","v":""},{"$f":"IF(AND(A65<>\"\",Deliverables!I64<>\"\"),Deliverables!I64,\"\")","v":""},{"$f":"IF(AND(A65<>\"\",Deliverables!J64<>\"\"),Deliverables!J64,\"\")","v":""},{"$f":"IF(AND(A65<>\"\",Deliverables!K64<>\"\"),Deliverables!K64,\"\")","v":""},{"$f":"IF(AND(A65<>\"\",Deliverables!L64<>\"\"),Deliverables!L64,\"\")","v":""}]
[{"$f":"IF(Deliverables!B65<>\"\",Deliverables!B65,\"\")","v":""},{"$f":"IF(AND(A66<>\"\",Deliverables!C65<>\"\"),Deliverables!C65,\"\")","v":""},{"$f":"IF(AND(A66<>\"\",Deliverables!D65<>\"\"),Deliverables!D65,\"\")","v":""},{"$f":"IF(AND(A66<>\"\",Deliverables!E65<>\"\"),Deliverables!E65,\"\")","v":""},{"$f":"IF(AND(A66<>\"\",Deliverables!F65<>\"\"),Deliverables!F65,\"\")","v":""},{"$f":"IF(AND(A66<>\"\",Deliverables!G65<>\"\"),Deliverables!G65,\"\")","v":""},{"$f":"IF(AND(A66<>\"\",Deliverables!H65<>\"\"),Deliverables!H65,\"\")","v":""},{"$f":"IF(AND(A66<>\"\",Deliverables!I65<>\"\"),Deliverables!I65,\"\")","v":""},{"$f":"IF(AND(A66<>\"\",Deliverables!J65<>\"\"),Deliverables!J65,\"\")","v":""},{"$f":"IF(AND(A66<>\"\",Deliverables!K65<>\"\"),Deliverables!K65,\"\")","v":""},{"$f":"IF(AND(A66<>\"\",Deliverables!L65<>\"\"),Deliverables!L65,\"\")","v":""}]
[{"$f":"IF(Deliverables!B66<>\"\",Deliverables!B66,\"\")","v":""},{"$f":"IF(AND(A67<>\"\",Deliverables!C66<>\"\"),Deliverables!C66,\"\")","v":""},{"$f":"IF(AND(A67<>\"\",Deliverables!D66<>\"\"),Deliverables!D66,\"\")","v":""},{"$f":"IF(AND(A67<>\"\",Deliverables!E66<>\"\"),Deliverables!E66,\"\")","v":""},{"$f":"IF(AND(A67<>\"\",Deliverables!F66<>\"\"),Deliverables!F66,\"\")","v":""},{"$f":"IF(AND(A67<>\"\",Deliverables!G66<>\"\"),Deliverables!G66,\"\")","v":""},{"$f":"IF(AND(A67<>\"\",Deliverables!H66<>\"\"),Deliverables!H66,\"\")","v":""},{"$f":"IF(AND(A67<>\"\",Deliverables!I66<>\"\"),Deliverables!I66,\"\")","v":""},{"$f":"IF(AND(A67<>\"\",Deliverables!J66<>\"\"),Deliverables!J66,\"\")","v":""},{"$f":"IF(AND(A67<>\"\",Deliverables!K66<>\"\"),Deliverables!K66,\"\")","v":""},{"$f":"IF(AND(A67<>\"\",Deliverables!L66<>\"\"),Deliverables!L66,\"\")","v":""}]
[{"$f":"IF(Deliverables!B67<>\"\",Deliverables!B67,\"\")","v":""},{"$f":"IF(AND(A68<>\"\",Deliverables!C67<>\"\"),Deliverables!C67,\"\")","v":""},{"$f":"IF(AND(A68<>\"\",Deliverables!D67<>\"\"),Deliverables!D67,\"\")","v":""},{"$f":"IF(AND(A68<>\"\",Deliverables!E67<>\"\"),Deliverables!E67,\"\")","v":""},{"$f":"IF(AND(A68<>\"\",Deliverables!F67<>\"\"),Deliverables!F67,\"\")","v":""},{"$f":"IF(AND(A68<>\"\",Deliverables!G67<>\"\"),Deliverables!G67,\"\")","v":""},{"$f":"IF(AND(A68<>\"\",Deliverables!H67<>\"\"),Deliverables!H67,\"\")","v":""},{"$f":"IF(AND(A68<>\"\",Deliverables!I67<>\"\"),Deliverables!I67,\"\")","v":""},{"$f":"IF(AND(A68<>\"\",Deliverables!J67<>\"\"),Deliverables!J67,\"\")","v":""},{"$f":"IF(AND(A68<>\"\",Deliverables!K67<>\"\"),Deliverables!K67,\"\")","v":""},{"$f":"IF(AND(A68<>\"\",Deliverables!L67<>\"\"),Deliverables!L67,\"\")","v":""}]
[{"$f":"IF(Deliverables!B68<>\"\",Deliverables!B68,\"\")","v":""},{"$f":"IF(AND(A69<>\"\",Deliverables!C68<>\"\"),Deliverables!C68,\"\")","v":""},{"$f":"IF(AND(A69<>\"\",Deliverables!D68<>\"\"),Deliverables!D68,\"\")","v":""},{"$f":"IF(AND(A69<>\"\",Deliverables!E68<>\"\"),Deliverables!E68,\"\")","v":""},{"$f":"IF(AND(A69<>\"\",Deliverables!F68<>\"\"),Deliverables!F68,\"\")","v":""},{"$f":"IF(AND(A69<>\"\",Deliverables!G68<>\"\"),Deliverables!G68,\"\")","v":""},{"$f":"IF(AND(A69<>\"\",Deliverables!H68<>\"\"),Deliverables!H68,\"\")","v":""},{"$f":"IF(AND(A69<>\"\",Deliverables!I68<>\"\"),Deliverables!I68,\"\")","v":""},{"$f":"IF(AND(A69<>\"\",Deliverables!J68<>\"\"),Deliverables!J68,\"\")","v":""},{"$f":"IF(AND(A69<>\"\",Deliverables!K68<>\"\"),Deliverables!K68,\"\")","v":""},{"$f":"IF(AND(A69<>\"\",Deliverables!L68<>\"\"),Deliverables!L68,\"\")","v":""}]
[{"$f":"IF(Deliverables!B69<>\"\",Deliverables!B69,\"\")","v":""},{"$f":"IF(AND(A70<>\"\",Deliverables!C69<>\"\"),Deliverables!C69,\"\")","v":""},{"$f":"IF(AND(A70<>\"\",Deliverables!D69<>\"\"),Deliverables!D69,\"\")","v":""},{"$f":"IF(AND(A70<>\"\",Deliverables!E69<>\"\"),Deliverables!E69,\"\")","v":""},{"$f":"IF(AND(A70<>\"\",Deliverables!F69<>\"\"),Deliverables!F69,\"\")","v":""},{"$f":"IF(AND(A70<>\"\",Deliverables!G69<>\"\"),Deliverables!G69,\"\")","v":""},{"$f":"IF(AND(A70<>\"\",Deliverables!H69<>\"\"),Deliverables!H69,\"\")","v":""},{"$f":"IF(AND(A70<>\"\",Deliverables!I69<>\"\"),Deliverables!I69,\"\")","v":""},{"$f":"IF(AND(A70<>\"\",Deliverables!J69<>\"\"),Deliverables!J69,\"\")","v":""},{"$f":"IF(AND(A70<>\"\",Deliverables!K69<>\"\"),Deliverables!K69,\"\")","v":""},{"$f":"IF(AND(A70<>\"\",Deliverables!L69<>\"\"),Deliverables!L69,\"\")","v":""}]
[]
["Testing Documents",null,"Table 3 of 5"]
["ID","TITLE","ACRONYM",{"$f":"D2","v":"RR"},"PDR","CDR","TRR","QAR","IOCR","DCCR","FR"]
[{"$f":"IF(Deliverables!B71<>\"\",Deliverables!B71,\"\")","v":"S.TE01"},{"$f":"IF(AND(A74<>\"\",Deliverables!C71<>\"\"),Deliverables!C71,\"\")","v":"Testing Document #1"},{"$f":"IF(AND(A74<>\"\",Deliverables!D71<>\"\"),Deliverables!D71,\"\")","v":"ACR#6"},{"$f":"IF(AND(A74<>\"\",Deliverables!E71<>\"\"),Deliverables!E71,\"\")","v":""},{"$f":"IF(AND(A74<>\"\",Deliverables!F71<>\"\"),Deliverables!F71,\"\")","v":""},{"$f":"IF(AND(A74<>\"\",Deliverables!G71<>\"\"),Deliverables!G71,\"\")","v":" "},{"$f":"IF(AND(A74<>\"\",Deliverables!H71<>\"\"),Deliverables!H71,\"\")","v":"N"},{"$f":"IF(AND(A74<>\"\",Deliverables!I71<>\"\"),Deliverables!I71,\"\")","v":"U"},{"$f":"IF(AND(A74<>\"\",Deliverables!J71<>\"\"),Deliverables!J71,\"\")","v":"U"},{"$f":"IF(AND(A74<>\"\",Deliverables!K71<>\"\"),Deliverables!K71,\"\")","v":"C"},{"$f":"IF(AND(A74<>\"\",Deliverables!L71<>\"\"),Deliverables!L71,\"\")","v":"C"}]
[{"$f":"IF(Deliverables!B72<>\"\",Deliverables!B72,\"\")","v":"S.TE02"},{"$f":"IF(AND(A75<>\"\",Deliverables!C72<>\"\"),Deliverables!C72,\"\")","v":"Testing Document #2"},{"$f":"IF(AND(A75<>\"\",Deliverables!D72<>\"\"),Deliverables!D72,\"\")","v":"ACR#7"},{"$f":"IF(AND(A75<>\"\",Deliverables!E72<>\"\"),Deliverables!E72,\"\")","v":""},{"$f":"IF(AND(A75<>\"\",Deliverables!F72<>\"\"),Deliverables!F72,\"\")","v":""},{"$f":"IF(AND(A75<>\"\",Deliverables!G72<>\"\"),Deliverables!G72,\"\")","v":"N"},{"$f":"IF(AND(A75<>\"\",Deliverables!H72<>\"\"),Deliverables!H72,\"\")","v":""},{"$f":"IF(AND(A75<>\"\",Deliverables!I72<>\"\"),Deliverables!I72,\"\")","v":"U"},{"$f":"IF(AND(A75<>\"\",Deliverables!J72<>\"\"),Deliverables!J72,\"\")","v":"U"},{"$f":"IF(AND(A75<>\"\",Deliverables!K72<>\"\"),Deliverables!K72,\"\")","v":"C"},{"$f":"IF(AND(A75<>\"\",Deliverables!L72<>\"\"),Deliverables!L72,\"\")","v":"C"}]
[{"$f":"IF(Deliverables!B73<>\"\",Deliverables!B73,\"\")","v":"S.TE03"},{"$f":"IF(AND(A76<>\"\",Deliverables!C73<>\"\"),Deliverables!C73,\"\")","v":"Testing Document #3"},{"$f":"IF(AND(A76<>\"\",Deliverables!D73<>\"\"),Deliverables!D73,\"\")","v":"ACR#8"},{"$f":"IF(AND(A76<>\"\",Deliverables!E73<>\"\"),Deliverables!E73,\"\")","v":""},{"$f":"IF(AND(A76<>\"\",Deliverables!F73<>\"\"),Deliverables!F73,\"\")","v":""},{"$f":"IF(AND(A76<>\"\",Deliverables!G73<>\"\"),Deliverables!G73,\"\")","v":"N"},{"$f":"IF(AND(A76<>\"\",Deliverables!H73<>\"\"),Deliverables!H73,\"\")","v":""},{"$f":"IF(AND(A76<>\"\",Deliverables!I73<>\"\"),Deliverables!I73,\"\")","v":"U"},{"$f":"IF(AND(A76<>\"\",Deliverables!J73<>\"\"),Deliverables!J73,\"\")","v":"U"},{"$f":"IF(AND(A76<>\"\",Deliverables!K73<>\"\"),Deliverables!K73,\"\")","v":"C"},{"$f":"IF(AND(A76<>\"\",Deliverables!L73<>\"\"),Deliverables!L73,\"\")","v":"C"}]
[{"$f":"IF(Deliverables!B74<>\"\",Deliverables!B74,\"\")","v":""},{"$f":"IF(AND(A77<>\"\",Deliverables!C74<>\"\"),Deliverables!C74,\"\")","v":""},{"$f":"IF(AND(A77<>\"\",Deliverables!D74<>\"\"),Deliverables!D74,\"\")","v":""},{"$f":"IF(AND(A77<>\"\",Deliverables!E74<>\"\"),Deliverables!E74,\"\")","v":""},{"$f":"IF(AND(A77<>\"\",Deliverables!F74<>\"\"),Deliverables!F74,\"\")","v":""},{"$f":"IF(AND(A77<>\"\",Deliverables!G74<>\"\"),Deliverables!G74,\"\")","v":""},{"$f":"IF(AND(A77<>\"\",Deliverables!H74<>\"\"),Deliverables!H74,\"\")","v":""},{"$f":"IF(AND(A77<>\"\",Deliverables!I74<>\"\"),Deliverables!I74,\"\")","v":""},{"$f":"IF(AND(A77<>\"\",Deliverables!J74<>\"\"),Deliverables!J74,\"\")","v":""},{"$f":"IF(AND(A77<>\"\",Deliverables!K74<>\"\"),Deliverables!K74,\"\")","v":""},{"$f":"IF(AND(A77<>\"\",Deliverables!L74<>\"\"),Deliverables!L74,\"\")","v":""}]
[{"$f":"IF(Deliverables!B75<>\"\",Deliverables!B75,\"\")","v":""},{"$f":"IF(AND(A78<>\"\",Deliverables!C75<>\"\"),Deliverables!C75,\"\")","v":""},{"$f":"IF(AND(A78<>\"\",Deliverables!D75<>\"\"),Deliverables!D75,\"\")","v":""},{"$f":"IF(AND(A78<>\"\",Deliverables!E75<>\"\"),Deliverables!E75,\"\")","v":""},{"$f":"IF(AND(A78<>\"\",Deliverables!F75<>\"\"),Deliverables!F75,\"\")","v":""},{"$f":"IF(AND(A78<>\"\",Deliverables!G75<>\"\"),Deliverables!G75,\"\")","v":""},{"$f":"IF(AND(A78<>\"\",Deliverables!H75<>\"\"),Deliverables!H75,\"\")","v":""},{"$f":"IF(AND(A78<>\"\",Deliverables!I75<>\"\"),Deliverables!I75,\"\")","v":""},{"$f":"IF(AND(A78<>\"\",Deliverables!J75<>\"\"),Deliverables!J75,\"\")","v":""},{"$f":"IF(AND(A78<>\"\",Deliverables!K75<>\"\"),Deliverables!K75,\"\")","v":""},{"$f":"IF(AND(A78<>\"\",Deliverables!L75<>\"\"),Deliverables!L75,\"\")","v":""}]
[{"$f":"IF(Deliverables!B76<>\"\",Deliverables!B76,\"\")","v":""},{"$f":"IF(AND(A79<>\"\",Deliverables!C76<>\"\"),Deliverables!C76,\"\")","v":""},{"$f":"IF(AND(A79<>\"\",Deliverables!D76<>\"\"),Deliverables!D76,\"\")","v":""},{"$f":"IF(AND(A79<>\"\",Deliverables!E76<>\"\"),Deliverables!E76,\"\")","v":""},{"$f":"IF(AND(A79<>\"\",Deliverables!F76<>\"\"),Deliverables!F76,\"\")","v":""},{"$f":"IF(AND(A79<>\"\",Deliverables!G76<>\"\"),Deliverables!G76,\"\")","v":""},{"$f":"IF(AND(A79<>\"\",Deliverables!H76<>\"\"),Deliverables!H76,\"\")","v":""},{"$f":"IF(AND(A79<>\"\",Deliverables!I76<>\"\"),Deliverables!I76,\"\")","v":""},{"$f":"IF(AND(A79<>\"\",Deliverables!J76<>\"\"),Deliverables!J76,\"\")","v":""},{"$f":"IF(AND(A79<>\"\",Deliverables!K76<>\"\"),Deliverables!K76,\"\")","v":""},{"$f":"IF(AND(A79<>\"\",Deliverables!L76<>\"\"),Deliverables!L76,\"\")","v":""}]
[{"$f":"IF(Deliverables!B77<>\"\",Deliverables!B77,\"\")","v":""},{"$f":"IF(AND(A80<>\"\",Deliverables!C77<>\"\"),Deliverables!C77,\"\")","v":""},{"$f":"IF(AND(A80<>\"\",Deliverables!D77<>\"\"),Deliverables!D77,\"\")","v":""},{"$f":"IF(AND(A80<>\"\",Deliverables!E77<>\"\"),Deliverables!E77,\"\")","v":""},{"$f":"IF(AND(A80<>\"\",Deliverables!F77<>\"\"),Deliverables!F77,\"\")","v":""},{"$f":"IF(AND(A80<>\"\",Deliverables!G77<>\"\"),Deliverables!G77,\"\")","v":""},{"$f":"IF(AND(A80<>\"\",Deliverables!H77<>\"\"),Deliverables!H77,\"\")","v":""},{"$f":"IF(AND(A80<>\"\",Deliverables!I77<>\"\"),Deliverables!I77,\"\")","v":""},{"$f":"IF(AND(A80<>\"\",Deliverables!J77<>\"\"),Deliverables!J77,\"\")","v":""},{"$f":"IF(AND(A80<>\"\",Deliverables!K77<>\"\"),Deliverables!K77,\"\")","v":""},{"$f":"IF(AND(A80<>\"\",Deliverables!L77<>\"\"),Deliverables!L77,\"\")","v":""}]
[{"$f":"IF(Deliverables!B78<>\"\",Deliverables!B78,\"\")","v":""},{"$f":"IF(AND(A81<>\"\",Deliverables!C78<>\"\"),Deliverables!C78,\"\")","v":""},{"$f":"IF(AND(A81<>\"\",Deliverables!D78<>\"\"),Deliverables!D78,\"\")","v":""},{"$f":"IF(AND(A81<>\"\",Deliverables!E78<>\"\"),Deliverables!E78,\"\")","v":""},{"$f":"IF(AND(A81<>\"\",Deliverables!F78<>\"\"),Deliverables!F78,\"\")","v":""},{"$f":"IF(AND(A81<>\"\",Deliverables!G78<>\"\"),Deliverables!G78,\"\")","v":""},{"$f":"IF(AND(A81<>\"\",Deliverables!H78<>\"\"),Deliverables!H78,\"\")","v":""},{"$f":"IF(AND(A81<>\"\",Deliverables!I78<>\"\"),Deliverables!I78,\"\")","v":""},{"$f":"IF(AND(A81<>\"\",Deliverables!J78<>\"\"),Deliverables!J78,\"\")","v":""},{"$f":"IF(AND(A81<>\"\",Deliverables!K78<>\"\"),Deliverables!K78,\"\")","v":""},{"$f":"IF(AND(A81<>\"\",Deliverables!L78<>\"\"),Deliverables!L78,\"\")","v":""}]
[{"$f":"IF(Deliverables!B79<>\"\",Deliverables!B79,\"\")","v":""},{"$f":"IF(AND(A82<>\"\",Deliverables!C79<>\"\"),Deliverables!C79,\"\")","v":""},{"$f":"IF(AND(A82<>\"\",Deliverables!D79<>\"\"),Deliverables!D79,\"\")","v":""},{"$f":"IF(AND(A82<>\"\",Deliverables!E79<>\"\"),Deliverables!E79,\"\")","v":""},{"$f":"IF(AND(A82<>\"\",Deliverables!F79<>\"\"),Deliverables!F79,\"\")","v":""},{"$f":"IF(AND(A82<>\"\",Deliverables!G79<>\"\"),Deliverables!G79,\"\")","v":""},{"$f":"IF(AND(A82<>\"\",Deliverables!H79<>\"\"),Deliverables!H79,\"\")","v":""},{"$f":"IF(AND(A82<>\"\",Deliverables!I79<>\"\"),Deliverables!I79,\"\")","v":""},{"$f":"IF(AND(A82<>\"\",Deliverables!J79<>\"\"),Deliverables!J79,\"\")","v":""},{"$f":"IF(AND(A82<>\"\",Deliverables!K79<>\"\"),Deliverables!K79,\"\")","v":""},{"$f":"IF(AND(A82<>\"\",Deliverables!L79<>\"\"),Deliverables!L79,\"\")","v":""}]
[{"$f":"IF(Deliverables!B80<>\"\",Deliverables!B80,\"\")","v":""},{"$f":"IF(AND(A83<>\"\",Deliverables!C80<>\"\"),Deliverables!C80,\"\")","v":""},{"$f":"IF(AND(A83<>\"\",Deliverables!D80<>\"\"),Deliverables!D80,\"\")","v":""},{"$f":"IF(AND(A83<>\"\",Deliverables!E80<>\"\"),Deliverables!E80,\"\")","v":""},{"$f":"IF(AND(A83<>\"\",Deliverables!F80<>\"\"),Deliverables!F80,\"\")","v":""},{"$f":"IF(AND(A83<>\"\",Deliverables!G80<>\"\"),Deliverables!G80,\"\")","v":""},{"$f":"IF(AND(A83<>\"\",Deliverables!H80<>\"\"),Deliverables!H80,\"\")","v":""},{"$f":"IF(AND(A83<>\"\",Deliverables!I80<>\"\"),Deliverables!I80,\"\")","v":""},{"$f":"IF(AND(A83<>\"\",Deliverables!J80<>\"\"),Deliverables!J80,\"\")","v":""},{"$f":"IF(AND(A83<>\"\",Deliverables!K80<>\"\"),Deliverables!K80,\"\")","v":""},{"$f":"IF(AND(A83<>\"\",Deliverables!L80<>\"\"),Deliverables!L80,\"\")","v":""}]
[{"$f":"IF(Deliverables!B81<>\"\",Deliverables!B81,\"\")","v":""},{"$f":"IF(AND(A84<>\"\",Deliverables!C81<>\"\"),Deliverables!C81,\"\")","v":""},{"$f":"IF(AND(A84<>\"\",Deliverables!D81<>\"\"),Deliverables!D81,\"\")","v":""},{"$f":"IF(AND(A84<>\"\",Deliverables!E81<>\"\"),Deliverables!E81,\"\")","v":""},{"$f":"IF(AND(A84<>\"\",Deliverables!F81<>\"\"),Deliverables!F81,\"\")","v":""},{"$f":"IF(AND(A84<>\"\",Deliverables!G81<>\"\"),Deliverables!G81,\"\")","v":""},{"$f":"IF(AND(A84<>\"\",Deliverables!H81<>\"\"),Deliverables!H81,\"\")","v":""},{"$f":"IF(AND(A84<>\"\",Deliverables!I81<>\"\"),Deliverables!I81,\"\")","v":""},{"$f":"IF(AND(A84<>\"\",Deliverables!J81<>\"\"),Deliverables!J81,\"\")","v":""},{"$f":"IF(AND(A84<>\"\",Deliverables!K81<>\"\"),Deliverables!K81,\"\")","v":""},{"$f":"IF(AND(A84<>\"\",Deliverables!L81<>\"\"),Deliverables!L81,\"\")","v":""}]
[{"$f":"IF(Deliverables!B82<>\"\",Deliverables!B82,\"\")","v":""},{"$f":"IF(AND(A85<>\"\",Deliverables!C82<>\"\"),Deliverables!C82,\"\")","v":""},{"$f":"IF(AND(A85<>\"\",Deliverables!D82<>\"\"),Deliverables!D82,\"\")","v":""},{"$f":"IF(AND(A85<>\"\",Deliverables!E82<>\"\"),Deliverables!E82,\"\")","v":""},{"$f":"IF(AND(A85<>\"\",Deliverables!F82<>\"\"),Deliverables!F82,\"\")","v":""},{"$f":"IF(AND(A85<>\"\",Deliverables!G82<>\"\"),Deliverables!G82,\"\")","v":""},{"$f":"IF(AND(A85<>\"\",Deliverables!H82<>\"\"),Deliverables!H82,\"\")","v":""},{"$f":"IF(AND(A85<>\"\",Deliverables!I82<>\"\"),Deliverables!I82,\"\")","v":""},{"$f":"IF(AND(A85<>\"\",Deliverables!J82<>\"\"),Deliverables!J82,\"\")","v":""},{"$f":"IF(AND(A85<>\"\",Deliverables!K82<>\"\"),Deliverables!K82,\"\")","v":""},{"$f":"IF(AND(A85<>\"\",Deliverables!L82<>\"\"),Deliverables!L82,\"\")","v":""}]
[{"$f":"IF(Deliverables!B83<>\"\",Deliverables!B83,\"\")","v":""},{"$f":"IF(AND(A86<>\"\",Deliverables!C83<>\"\"),Deliverables!C83,\"\")","v":""},{"$f":"IF(AND(A86<>\"\",Deliverables!D83<>\"\"),Deliverables!D83,\"\")","v":""},{"$f":"IF(AND(A86<>\"\",Deliverables!E83<>\"\"),Deliverables!E83,\"\")","v":""},{"$f":"IF(AND(A86<>\"\",Deliverables!F83<>\"\"),Deliverables!F83,\"\")","v":""},{"$f":"IF(AND(A86<>\"\",Deliverables!G83<>\"\"),Deliverables!G83,\"\")","v":""},{"$f":"IF(AND(A86<>\"\",Deliverables!H83<>\"\"),Deliverables!H83,\"\")","v":""},{"$f":"IF(AND(A86<>\"\",Deliverables!I83<>\"\"),Deliverables!I83,\"\")","v":""},{"$f":"IF(AND(A86<>\"\",Deliverables!J83<>\"\"),Deliverables!J83,\"\")","v":""},{"$f":"IF(AND(A86<>\"\",Deliverables!K83<>\"\"),Deliverables!K83,\"\")","v":""},{"$f":"IF(AND(A86<>\"\",Deliverables!L83<>\"\"),Deliverables!L83,\"\")","v":""}]
[{"$f":"IF(Deliverables!B84<>\"\",Deliverables!B84,\"\")","v":""},{"$f":"IF(AND(A87<>\"\",Deliverables!C84<>\"\"),Deliverables!C84,\"\")","v":""},{"$f":"IF(AND(A87<>\"\",Deliverables!D84<>\"\"),Deliverables!D84,\"\")","v":""},{"$f":"IF(AND(A87<>\"\",Deliverables!E84<>\"\"),Deliverables!E84,\"\")","v":""},{"$f":"IF(AND(A87<>\"\",Deliverables!F84<>\"\"),Deliverables!F84,\"\")","v":""},{"$f":"IF(AND(A87<>\"\",Deliverables!G84<>\"\"),Deliverables!G84,\"\")","v":""},{"$f":"IF(AND(A87<>\"\",Deliverables!H84<>\"\"),Deliverables!H84,\"\")","v":""},{"$f":"IF(AND(A87<>\"\",Deliverables!I84<>\"\"),Deliverables!I84,\"\")","v":""},{"$f":"IF(AND(A87<>\"\",Deliverables!J84<>\"\"),Deliverables!J84,\"\")","v":""},{"$f":"IF(AND(A87<>\"\",Deliverables!K84<>\"\"),Deliverables!K84,\"\")","v":""},{"$f":"IF(AND(A87<>\"\",Deliverables!L84<>\"\"),Deliverables!L84,\"\")","v":""}]
[{"$f":"IF(Deliverables!B85<>\"\",Deliverables!B85,\"\")","v":""},{"$f":"IF(AND(A88<>\"\",Deliverables!C85<>\"\"),Deliverables!C85,\"\")","v":""},{"$f":"IF(AND(A88<>\"\",Deliverables!D85<>\"\"),Deliverables!D85,\"\")","v":""},{"$f":"IF(AND(A88<>\"\",Deliverables!E85<>\"\"),Deliverables!E85,\"\")","v":""},{"$f":"IF(AND(A88<>\"\",Deliverables!F85<>\"\"),Deliverables!F85,\"\")","v":""},{"$f":"IF(AND(A88<>\"\",Deliverables!G85<>\"\"),Deliverables!G85,\"\")","v":""},{"$f":"IF(AND(A88<>\"\",Deliverables!H85<>\"\"),Deliverables!H85,\"\")","v":""},{"$f":"IF(AND(A88<>\"\",Deliverables!I85<>\"\"),Deliverables!I85,\"\")","v":""},{"$f":"IF(AND(A88<>\"\",Deliverables!J85<>\"\"),Deliverables!J85,\"\")","v":""},{"$f":"IF(AND(A88<>\"\",Deliverables!K85<>\"\"),Deliverables!K85,\"\")","v":""},{"$f":"IF(AND(A88<>\"\",Deliverables!L85<>\"\"),Deliverables!L85,\"\")","v":""}]
[{"$f":"IF(Deliverables!B86<>\"\",Deliverables!B86,\"\")","v":""},{"$f":"IF(AND(A89<>\"\",Deliverables!C86<>\"\"),Deliverables!C86,\"\")","v":""},{"$f":"IF(AND(A89<>\"\",Deliverables!D86<>\"\"),Deliverables!D86,\"\")","v":""},{"$f":"IF(AND(A89<>\"\",Deliverables!E86<>\"\"),Deliverables!E86,\"\")","v":""},{"$f":"IF(AND(A89<>\"\",Deliverables!F86<>\"\"),Deliverables!F86,\"\")","v":""},{"$f":"IF(AND(A89<>\"\",Deliverables!G86<>\"\"),Deliverables!G86,\"\")","v":""},{"$f":"IF(AND(A89<>\"\",Deliverables!H86<>\"\"),Deliverables!H86,\"\")","v":""},{"$f":"IF(AND(A89<>\"\",Deliverables!I86<>\"\"),Deliverables!I86,\"\")","v":""},{"$f":"IF(AND(A89<>\"\",Deliverables!J86<>\"\"),Deliverables!J86,\"\")","v":""},{"$f":"IF(AND(A89<>\"\",Deliverables!K86<>\"\"),Deliverables!K86,\"\")","v":""},{"$f":"IF(AND(A89<>\"\",Deliverables!L86<>\"\"),Deliverables!L86,\"\")","v":""}]
[{"$f":"IF(Deliverables!B87<>\"\",Deliverables!B87,\"\")","v":""},{"$f":"IF(AND(A90<>\"\",Deliverables!C87<>\"\"),Deliverables!C87,\"\")","v":""},{"$f":"IF(AND(A90<>\"\",Deliverables!D87<>\"\"),Deliverables!D87,\"\")","v":""},{"$f":"IF(AND(A90<>\"\",Deliverables!E87<>\"\"),Deliverables!E87,\"\")","v":""},{"$f":"IF(AND(A90<>\"\",Deliverables!F87<>\"\"),Deliverables!F87,\"\")","v":""},{"$f":"IF(AND(A90<>\"\",Deliverables!G87<>\"\"),Deliverables!G87,\"\")","v":""},{"$f":"IF(AND(A90<>\"\",Deliverables!H87<>\"\"),Deliverables!H87,\"\")","v":""},{"$f":"IF(AND(A90<>\"\",Deliverables!I87<>\"\"),Deliverables!I87,\"\")","v":""},{"$f":"IF(AND(A90<>\"\",Deliverables!J87<>\"\"),Deliverables!J87,\"\")","v":""},{"$f":"IF(AND(A90<>\"\",Deliverables!K87<>\"\"),Deliverables!K87,\"\")","v":""},{"$f":"IF(AND(A90<>\"\",Deliverables!L87<>\"\"),Deliverables!L87,\"\")","v":""}]
[{"$f":"IF(Deliverables!B88<>\"\",Deliverables!B88,\"\")","v":""},{"$f":"IF(AND(A91<>\"\",Deliverables!C88<>\"\"),Deliverables!C88,\"\")","v":""},{"$f":"IF(AND(A91<>\"\",Deliverables!D88<>\"\"),Deliverables!D88,\"\")","v":""},{"$f":"IF(AND(A91<>\"\",Deliverables!E88<>\"\"),Deliverables!E88,\"\")","v":""},{"$f":"IF(AND(A91<>\"\",Deliverables!F88<>\"\"),Deliverables!F88,\"\")","v":""},{"$f":"IF(AND(A91<>\"\",Deliverables!G88<>\"\"),Deliverables!G88,\"\")","v":""},{"$f":"IF(AND(A91<>\"\",Deliverables!H88<>\"\"),Deliverables!H88,\"\")","v":""},{"$f":"IF(AND(A91<>\"\",Deliverables!I88<>\"\"),Deliverables!I88,\"\")","v":""},{"$f":"IF(AND(A91<>\"\",Deliverables!J88<>\"\"),Deliverables!J88,\"\")","v":""},{"$f":"IF(AND(A91<>\"\",Deliverables!K88<>\"\"),Deliverables!K88,\"\")","v":""},{"$f":"IF(AND(A91<>\"\",Deliverables!L88<>\"\"),Deliverables!L88,\"\")","v":""}]
[{"$f":"IF(Deliverables!B89<>\"\",Deliverables!B89,\"\")","v":""},{"$f":"IF(AND(A92<>\"\",Deliverables!C89<>\"\"),Deliverables!C89,\"\")","v":""},{"$f":"IF(AND(A92<>\"\",Deliverables!D89<>\"\"),Deliverables!D89,\"\")","v":""},{"$f":"IF(AND(A92<>\"\",Deliverables!E89<>\"\"),Deliverables!E89,\"\")","v":""},{"$f":"IF(AND(A92<>\"\",Deliverables!F89<>\"\"),Deliverables!F89,\"\")","v":""},{"$f":"IF(AND(A92<>\"\",Deliverables!G89<>\"\"),Deliverables!G89,\"\")","v":""},{"$f":"IF(AND(A92<>\"\",Deliverables!H89<>\"\"),Deliverables!H89,\"\")","v":""},{"$f":"IF(AND(A92<>\"\",Deliverables!I89<>\"\"),Deliverables!I89,\"\")","v":""},{"$f":"IF(AND(A92<>\"\",Deliverables!J89<>\"\"),Deliverables!J89,\"\")","v":""},{"$f":"IF(AND(A92<>\"\",Deliverables!K89<>\"\"),Deliverables!K89,\"\")","v":""},{"$f":"IF(AND(A92<>\"\",Deliverables!L89<>\"\"),Deliverables!L89,\"\")","v":""}]
[{"$f":"IF(Deliverables!B90<>\"\",Deliverables!B90,\"\")","v":""},{"$f":"IF(AND(A93<>\"\",Deliverables!C90<>\"\"),Deliverables!C90,\"\")","v":""},{"$f":"IF(AND(A93<>\"\",Deliverables!D90<>\"\"),Deliverables!D90,\"\")","v":""},{"$f":"IF(AND(A93<>\"\",Deliverables!E90<>\"\"),Deliverables!E90,\"\")","v":""},{"$f":"IF(AND(A93<>\"\",Deliverables!F90<>\"\"),Deliverables!F90,\"\")","v":""},{"$f":"IF(AND(A93<>\"\",Deliverables!G90<>\"\"),Deliverables!G90,\"\")","v":""},{"$f":"IF(AND(A93<>\"\",Deliverables!H90<>\"\"),Deliverables!H90,\"\")","v":""},{"$f":"IF(AND(A93<>\"\",Deliverables!I90<>\"\"),Deliverables!I90,\"\")","v":""},{"$f":"IF(AND(A93<>\"\",Deliverables!J90<>\"\"),Deliverables!J90,\"\")","v":""},{"$f":"IF(AND(A93<>\"\",Deliverables!K90<>\"\"),Deliverables!K90,\"\")","v":""},{"$f":"IF(AND(A93<>\"\",Deliverables!L90<>\"\"),Deliverables!L90,\"\")","v":""}]
[{"$f":"IF(Deliverables!B91<>\"\",Deliverables!B91,\"\")","v":""},{"$f":"IF(AND(A94<>\"\",Deliverables!C91<>\"\"),Deliverables!C91,\"\")","v":""},{"$f":"IF(AND(A94<>\"\",Deliverables!D91<>\"\"),Deliverables!D91,\"\")","v":""},{"$f":"IF(AND(A94<>\"\",Deliverables!E91<>\"\"),Deliverables!E91,\"\")","v":""},{"$f":"IF(AND(A94<>\"\",Deliverables!F91<>\"\"),Deliverables!F91,\"\")","v":""},{"$f":"IF(AND(A94<>\"\",Deliverables!G91<>\"\"),Deliverables!G91,\"\")","v":""},{"$f":"IF(AND(A94<>\"\",Deliverables!H91<>\"\"),Deliverables!H91,\"\")","v":""},{"$f":"IF(AND(A94<>\"\",Deliverables!I91<>\"\"),Deliverables!I91,\"\")","v":""},{"$f":"IF(AND(A94<>\"\",Deliverables!J91<>\"\"),Deliverables!J91,\"\")","v":""},{"$f":"IF(AND(A94<>\"\",Deliverables!K91<>\"\"),Deliverables!K91,\"\")","v":""},{"$f":"IF(AND(A94<>\"\",Deliverables!L91<>\"\"),Deliverables!L91,\"\")","v":""}]
[{"$f":"IF(Deliverables!B92<>\"\",Deliverables!B92,\"\")","v":""},{"$f":"IF(AND(A95<>\"\",Deliverables!C92<>\"\"),Deliverables!C92,\"\")","v":""},{"$f":"IF(AND(A95<>\"\",Deliverables!D92<>\"\"),Deliverables!D92,\"\")","v":""},{"$f":"IF(AND(A95<>\"\",Deliverables!E92<>\"\"),Deliverables!E92,\"\")","v":""},{"$f":"IF(AND(A95<>\"\",Deliverables!F92<>\"\"),Deliverables!F92,\"\")","v":""},{"$f":"IF(AND(A95<>\"\",Deliverables!G92<>\"\"),Deliverables!G92,\"\")","v":""},{"$f":"IF(AND(A95<>\"\",Deliverables!H92<>\"\"),Deliverables!H92,\"\")","v":""},{"$f":"IF(AND(A95<>\"\",Deliverables!I92<>\"\"),Deliverables!I92,\"\")","v":""},{"$f":"IF(AND(A95<>\"\",Deliverables!J92<>\"\"),Deliverables!J92,\"\")","v":""},{"$f":"IF(AND(A95<>\"\",Deliverables!K92<>\"\"),Deliverables!K92,\"\")","v":""},{"$f":"IF(AND(A95<>\"\",Deliverables!L92<>\"\"),Deliverables!L92,\"\")","v":""}]
[{"$f":"IF(Deliverables!B93<>\"\",Deliverables!B93,\"\")","v":""},{"$f":"IF(AND(A96<>\"\",Deliverables!C93<>\"\"),Deliverables!C93,\"\")","v":""},{"$f":"IF(AND(A96<>\"\",Deliverables!D93<>\"\"),Deliverables!D93,\"\")","v":""},{"$f":"IF(AND(A96<>\"\",Deliverables!E93<>\"\"),Deliverables!E93,\"\")","v":""},{"$f":"IF(AND(A96<>\"\",Deliverables!F93<>\"\"),Deliverables!F93,\"\")","v":""},{"$f":"IF(AND(A96<>\"\",Deliverables!G93<>\"\"),Deliverables!G93,\"\")","v":""},{"$f":"IF(AND(A96<>\"\",Deliverables!H93<>\"\"),Deliverables!H93,\"\")","v":""},{"$f":"IF(AND(A96<>\"\",Deliverables!I93<>\"\"),Deliverables!I93,\"\")","v":""},{"$f":"IF(AND(A96<>\"\",Deliverables!J93<>\"\"),Deliverables!J93,\"\")","v":""},{"$f":"IF(AND(A96<>\"\",Deliverables!K93<>\"\"),Deliverables!K93,\"\")","v":""},{"$f":"IF(AND(A96<>\"\",Deliverables!L93<>\"\"),Deliverables!L93,\"\")","v":""}]
[{"$f":"IF(Deliverables!B94<>\"\",Deliverables!B94,\"\")","v":""},{"$f":"IF(AND(A97<>\"\",Deliverables!C94<>\"\"),Deliverables!C94,\"\")","v":""},{"$f":"IF(AND(A97<>\"\",Deliverables!D94<>\"\"),Deliverables!D94,\"\")","v":""},{"$f":"IF(AND(A97<>\"\",Deliverables!E94<>\"\"),Deliverables!E94,\"\")","v":""},{"$f":"IF(AND(A97<>\"\",Deliverables!F94<>\"\"),Deliverables!F94,\"\")","v":""},{"$f":"IF(AND(A97<>\"\",Deliverables!G94<>\"\"),Deliverables!G94,\"\")","v":""},{"$f":"IF(AND(A97<>\"\",Deliverables!H94<>\"\"),Deliverables!H94,\"\")","v":""},{"$f":"IF(AND(A97<>\"\",Deliverables!I94<>\"\"),Deliverables!I94,\"\")","v":""},{"$f":"IF(AND(A97<>\"\",Deliverables!J94<>\"\"),Deliverables!J94,\"\")","v":""},{"$f":"IF(AND(A97<>\"\",Deliverables!K94<>\"\"),Deliverables!K94,\"\")","v":""},{"$f":"IF(AND(A97<>\"\",Deliverables!L94<>\"\"),Deliverables!L94,\"\")","v":""}]
[{"$f":"IF(Deliverables!B95<>\"\",Deliverables!B95,\"\")","v":""},{"$f":"IF(AND(A98<>\"\",Deliverables!C95<>\"\"),Deliverables!C95,\"\")","v":""},{"$f":"IF(AND(A98<>\"\",Deliverables!D95<>\"\"),Deliverables!D95,\"\")","v":""},{"$f":"IF(AND(A98<>\"\",Deliverables!E95<>\"\"),Deliverables!E95,\"\")","v":""},{"$f":"IF(AND(A98<>\"\",Deliverables!F95<>\"\"),Deliverables!F95,\"\")","v":""},{"$f":"IF(AND(A98<>\"\",Deliverables!G95<>\"\"),Deliverables!G95,\"\")","v":""},{"$f":"IF(AND(A98<>\"\",Deliverables!H95<>\"\"),Deliverables!H95,\"\")","v":""},{"$f":"IF(AND(A98<>\"\",Deliverables!I95<>\"\"),Deliverables!I95,\"\")","v":""},{"$f":"IF(AND(A98<>\"\",Deliverables!J95<>\"\"),Deliverables!J95,\"\")","v":""},{"$f":"IF(AND(A98<>\"\",Deliverables!K95<>\"\"),Deliverables!K95,\"\")","v":""},{"$f":"IF(AND(A98<>\"\",Deliverables!L95<>\"\"),Deliverables!L95,\"\")","v":""}]
[]
["Product Assurance Documents",null,"Table 4 of 5"]
["ID","TITLE","ACRONYM",{"$f":"D2","v":"RR"},"PDR","CDR","TRR","QAR","IOCR","DCCR","FR"]
[{"$f":"IF(Deliverables!B97<>\"\",Deliverables!B97,\"\")","v":"S.PA01"},{"$f":"IF(AND(A102<>\"\",Deliverables!C97<>\"\"),Deliverables!C97,\"\")","v":"PA Document #1"},{"$f":"IF(AND(A102<>\"\",Deliverables!D97<>\"\"),Deliverables!D97,\"\")","v":"ACR#9"},{"$f":"IF(AND(A102<>\"\",Deliverables!E97<>\"\"),Deliverables!E97,\"\")","v":""},{"$f":"IF(AND(A102<>\"\",Deliverables!F97<>\"\"),Deliverables!F97,\"\")","v":""},{"$f":"IF(AND(A102<>\"\",Deliverables!G97<>\"\"),Deliverables!G97,\"\")","v":" "},{"$f":"IF(AND(A102<>\"\",Deliverables!H97<>\"\"),Deliverables!H97,\"\")","v":"N"},{"$f":"IF(AND(A102<>\"\",Deliverables!I97<>\"\"),Deliverables!I97,\"\")","v":"U"},{"$f":"IF(AND(A102<>\"\",Deliverables!J97<>\"\"),Deliverables!J97,\"\")","v":"U"},{"$f":"IF(AND(A102<>\"\",Deliverables!K97<>\"\"),Deliverables!K97,\"\")","v":"C"},{"$f":"IF(AND(A102<>\"\",Deliverables!L97<>\"\"),Deliverables!L97,\"\")","v":"C"}]
[{"$f":"IF(Deliverables!B98<>\"\",Deliverables!B98,\"\")","v":"S.PA02"},{"$f":"IF(AND(A103<>\"\",Deliverables!C98<>\"\"),Deliverables!C98,\"\")","v":"PA Document #2"},{"$f":"IF(AND(A103<>\"\",Deliverables!D98<>\"\"),Deliverables!D98,\"\")","v":"ACR#10"},{"$f":"IF(AND(A103<>\"\",Deliverables!E98<>\"\"),Deliverables!E98,\"\")","v":""},{"$f":"IF(AND(A103<>\"\",Deliverables!F98<>\"\"),Deliverables!F98,\"\")","v":""},{"$f":"IF(AND(A103<>\"\",Deliverables!G98<>\"\"),Deliverables!G98,\"\")","v":"N"},{"$f":"IF(AND(A103<>\"\",Deliverables!H98<>\"\"),Deliverables!H98,\"\")","v":""},{"$f":"IF(AND(A103<>\"\",Deliverables!I98<>\"\"),Deliverables!I98,\"\")","v":"U"},{"$f":"IF(AND(A103<>\"\",Deliverables!J98<>\"\"),Deliverables!J98,\"\")","v":"U"},{"$f":"IF(AND(A103<>\"\",Deliverables!K98<>\"\"),Deliverables!K98,\"\")","v":"C"},{"$f":"IF(AND(A103<>\"\",Deliverables!L98<>\"\"),Deliverables!L98,\"\")","v":"C"}]
[{"$f":"IF(Deliverables!B99<>\"\",Deliverables!B99,\"\")","v":""},{"$f":"IF(AND(A104<>\"\",Deliverables!C99<>\"\"),Deliverables!C99,\"\")","v":""},{"$f":"IF(AND(A104<>\"\",Deliverables!D99<>\"\"),Deliverables!D99,\"\")","v":""},{"$f":"IF(AND(A104<>\"\",Deliverables!E99<>\"\"),Deliverables!E99,\"\")","v":""},{"$f":"IF(AND(A104<>\"\",Deliverables!F99<>\"\"),Deliverables!F99,\"\")","v":""},{"$f":"IF(AND(A104<>\"\",Deliverables!G99<>\"\"),Deliverables!G99,\"\")","v":""},{"$f":"IF(AND(A104<>\"\",Deliverables!H99<>\"\"),Deliverables!H99,\"\")","v":""},{"$f":"IF(AND(A104<>\"\",Deliverables!I99<>\"\"),Deliverables!I99,\"\")","v":""},{"$f":"IF(AND(A104<>\"\",Deliverables!J99<>\"\"),Deliverables!J99,\"\")","v":""},{"$f":"IF(AND(A104<>\"\",Deliverables!K99<>\"\"),Deliverables!K99,\"\")","v":""},{"$f":"IF(AND(A104<>\"\",Deliverables!L99<>\"\"),Deliverables!L99,\"\")","v":""}]
[{"$f":"IF(Deliverables!B100<>\"\",Deliverables!B100,\"\")","v":""},{"$f":"IF(AND(A105<>\"\",Deliverables!C100<>\"\"),Deliverables!C100,\"\")","v":""},{"$f":"IF(AND(A105<>\"\",Deliverables!D100<>\"\"),Deliverables!D100,\"\")","v":""},{"$f":"IF(AND(A105<>\"\",Deliverables!E100<>\"\"),Deliverables!E100,\"\")","v":""},{"$f":"IF(AND(A105<>\"\",Deliverables!F100<>\"\"),Deliverables!F100,\"\")","v":""},{"$f":"IF(AND(A105<>\"\",Deliverables!G100<>\"\"),Deliverables!G100,\"\")","v":""},{"$f":"IF(AND(A105<>\"\",Deliverables!H100<>\"\"),Deliverables!H100,\"\")","v":""},{"$f":"IF(AND(A105<>\"\",Deliverables!I100<>\"\"),Deliverables!I100,\"\")","v":""},{"$f":"IF(AND(A105<>\"\",Deliverables!J100<>\"\"),Deliverables!J100,\"\")","v":""},{"$f":"IF(AND(A105<>\"\",Deliverables!K100<>\"\"),Deliverables!K100,\"\")","v":""},{"$f":"IF(AND(A105<>\"\",Deliverables!L100<>\"\"),Deliverables!L100,\"\")","v":""}]
[{"$f":"IF(Deliverables!B101<>\"\",Deliverables!B101,\"\")","v":""},{"$f":"IF(AND(A106<>\"\",Deliverables!C101<>\"\"),Deliverables!C101,\"\")","v":""},{"$f":"IF(AND(A106<>\"\",Deliverables!D101<>\"\"),Deliverables!D101,\"\")","v":""},{"$f":"IF(AND(A106<>\"\",Deliverables!E101<>\"\"),Deliverables!E101,\"\")","v":""},{"$f":"IF(AND(A106<>\"\",Deliverables!F101<>\"\"),Deliverables!F101,\"\")","v":""},{"$f":"IF(AND(A106<>\"\",Deliverables!G101<>\"\"),Deliverables!G101,\"\")","v":""},{"$f":"IF(AND(A106<>\"\",Deliverables!H101<>\"\"),Deliverables!H101,\"\")","v":""},{"$f":"IF(AND(A106<>\"\",Deliverables!I101<>\"\"),Deliverables!I101,\"\")","v":""},{"$f":"IF(AND(A106<>\"\",Deliverables!J101<>\"\"),Deliverables!J101,\"\")","v":""},{"$f":"IF(AND(A106<>\"\",Deliverables!K101<>\"\"),Deliverables!K101,\"\")","v":""},{"$f":"IF(AND(A106<>\"\",Deliverables!L101<>\"\"),Deliverables!L101,\"\")","v":""}]
[{"$f":"IF(Deliverables!B102<>\"\",Deliverables!B102,\"\")","v":""},{"$f":"IF(AND(A107<>\"\",Deliverables!C102<>\"\"),Deliverables!C102,\"\")","v":""},{"$f":"IF(AND(A107<>\"\",Deliverables!D102<>\"\"),Deliverables!D102,\"\")","v":""},{"$f":"IF(AND(A107<>\"\",Deliverables!E102<>\"\"),Deliverables!E102,\"\")","v":""},{"$f":"IF(AND(A107<>\"\",Deliverables!F102<>\"\"),Deliverables!F102,\"\")","v":""},{"$f":"IF(AND(A107<>\"\",Deliverables!G102<>\"\"),Deliverables!G102,\"\")","v":""},{"$f":"IF(AND(A107<>\"\",Deliverables!H102<>\"\"),Deliverables!H102,\"\")","v":""},{"$f":"IF(AND(A107<>\"\",Deliverables!I102<>\"\"),Deliverables!I102,\"\")","v":""},{"$f":"IF(AND(A107<>\"\",Deliverables!J102<>\"\"),Deliverables!J102,\"\")","v":""},{"$f":"IF(AND(A107<>\"\",Deliverables!K102<>\"\"),Deliverables!K102,\"\")","v":""},{"$f":"IF(AND(A107<>\"\",Deliverables!L102<>\"\"),Deliverables!L102,\"\")","v":""}]
[{"$f":"IF(Deliverables!B103<>\"\",Deliverables!B103,\"\")","v":""},{"$f":"IF(AND(A108<>\"\",Deliverables!C103<>\"\"),Deliverables!C103,\"\")","v":""},{"$f":"IF(AND(A108<>\"\",Deliverables!D103<>\"\"),Deliverables!D103,\"\")","v":""},{"$f":"IF(AND(A108<>\"\",Deliverables!E103<>\"\"),Deliverables!E103,\"\")","v":""},{"$f":"IF(AND(A108<>\"\",Deliverables!F103<>\"\"),Deliverables!F103,\"\")","v":""},{"$f":"IF(AND(A108<>\"\",Deliverables!G103<>\"\"),Deliverables!G103,\"\")","v":""},{"$f":"IF(AND(A108<>\"\",Deliverables!H103<>\"\"),Deliverables!H103,\"\")","v":""},{"$f":"IF(AND(A108<>\"\",Deliverables!I103<>\"\"),Deliverables!I103,\"\")","v":""},{"$f":"IF(AND(A108<>\"\",Deliverables!J103<>\"\"),Deliverables!J103,\"\")","v":""},{"$f":"IF(AND(A108<>\"\",Deliverables!K103<>\"\"),Deliverables!K103,\"\")","v":""},{"$f":"IF(AND(A108<>\"\",Deliverables!L103<>\"\"),Deliverables!L103,\"\")","v":""}]
[{"$f":"IF(Deliverables!B104<>\"\",Deliverables!B104,\"\")","v":""},{"$f":"IF(AND(A109<>\"\",Deliverables!C104<>\"\"),Deliverables!C104,\"\")","v":""},{"$f":"IF(AND(A109<>\"\",Deliverables!D104<>\"\"),Deliverables!D104,\"\")","v":""},{"$f":"IF(AND(A109<>\"\",Deliverables!E104<>\"\"),Deliverables!E104,\"\")","v":""},{"$f":"IF(AND(A109<>\"\",Deliverables!F104<>\"\"),Deliverables!F104,\"\")","v":""},{"$f":"IF(AND(A109<>\"\",Deliverables!G104<>\"\"),Deliverables!G104,\"\")","v":""},{"$f":"IF(AND(A109<>\"\",Deliverables!H104<>\"\"),Deliverables!H104,\"\")","v":""},{"$f":"IF(AND(A109<>\"\",Deliverables!I104<>\"\"),Deliverables!I104,\"\")","v":""},{"$f":"IF(AND(A109<>\"\",Deliverables!J104<>\"\"),Deliverables!J104,\"\")","v":""},{"$f":"IF(AND(A109<>\"\",Deliverables!K104<>\"\"),Deliverables!K104,\"\")","v":""},{"$f":"IF(AND(A109<>\"\",Deliverables!L104<>\"\"),Deliverables!L104,\"\")","v":""}]
[{"$f":"IF(Deliverables!B105<>\"\",Deliverables!B105,\"\")","v":""},{"$f":"IF(AND(A110<>\"\",Deliverables!C105<>\"\"),Deliverables!C105,\"\")","v":""},{"$f":"IF(AND(A110<>\"\",Deliverables!D105<>\"\"),Deliverables!D105,\"\")","v":""},{"$f":"IF(AND(A110<>\"\",Deliverables!E105<>\"\"),Deliverables!E105,\"\")","v":""},{"$f":"IF(AND(A110<>\"\",Deliverables!F105<>\"\"),Deliverables!F105,\"\")","v":""},{"$f":"IF(AND(A110<>\"\",Deliverables!G105<>\"\"),Deliverables!G105,\"\")","v":""},{"$f":"IF(AND(A110<>\"\",Deliverables!H105<>\"\"),Deliverables!H105,\"\")","v":""},{"$f":"IF(AND(A110<>\"\",Deliverables!I105<>\"\"),Deliverables!I105,\"\")","v":""},{"$f":"IF(AND(A110<>\"\",Deliverables!J105<>\"\"),Deliverables!J105,\"\")","v":""},{"$f":"IF(AND(A110<>\"\",Deliverables!K105<>\"\"),Deliverables!K105,\"\")","v":""},{"$f":"IF(AND(A110<>\"\",Deliverables!L105<>\"\"),Deliverables!L105,\"\")","v":""}]
[{"$f":"IF(Deliverables!B106<>\"\",Deliverables!B106,\"\")","v":""},{"$f":"IF(AND(A111<>\"\",Deliverables!C106<>\"\"),Deliverables!C106,\"\")","v":""},{"$f":"IF(AND(A111<>\"\",Deliverables!D106<>\"\"),Deliverables!D106,\"\")","v":""},{"$f":"IF(AND(A111<>\"\",Deliverables!E106<>\"\"),Deliverables!E106,\"\")","v":""},{"$f":"IF(AND(A111<>\"\",Deliverables!F106<>\"\"),Deliverables!F106,\"\")","v":""},{"$f":"IF(AND(A111<>\"\",Deliverables!G106<>\"\"),Deliverables!G106,\"\")","v":""},{"$f":"IF(AND(A111<>\"\",Deliverables!H106<>\"\"),Deliverables!H106,\"\")","v":""},{"$f":"IF(AND(A111<>\"\",Deliverables!I106<>\"\"),Deliverables!I106,\"\")","v":""},{"$f":"IF(AND(A111<>\"\",Deliverables!J106<>\"\"),Deliverables!J106,\"\")","v":""},{"$f":"IF(AND(A111<>\"\",Deliverables!K106<>\"\"),Deliverables!K106,\"\")","v":""},{"$f":"IF(AND(A111<>\"\",Deliverables!L106<>\"\"),Deliverables!L106,\"\")","v":""}]
[{"$f":"IF(Deliverables!B107<>\"\",Deliverables!B107,\"\")","v":""},{"$f":"IF(AND(A112<>\"\",Deliverables!C107<>\"\"),Deliverables!C107,\"\")","v":""},{"$f":"IF(AND(A112<>\"\",Deliverables!D107<>\"\"),Deliverables!D107,\"\")","v":""},{"$f":"IF(AND(A112<>\"\",Deliverables!E107<>\"\"),Deliverables!E107,\"\")","v":""},{"$f":"IF(AND(A112<>\"\",Deliverables!F107<>\"\"),Deliverables!F107,\"\")","v":""},{"$f":"IF(AND(A112<>\"\",Deliverables!G107<>\"\"),Deliverables!G107,\"\")","v":""},{"$f":"IF(AND(A112<>\"\",Deliverables!H107<>\"\"),Deliverables!H107,\"\")","v":""},{"$f":"IF(AND(A112<>\"\",Deliverables!I107<>\"\"),Deliverables!I107,\"\")","v":""},{"$f":"IF(AND(A112<>\"\",Deliverables!J107<>\"\"),Deliverables!J107,\"\")","v":""},{"$f":"IF(AND(A112<>\"\",Deliverables!K107<>\"\"),Deliverables!K107,\"\")","v":""},{"$f":"IF(AND(A112<>\"\",Deliverables!L107<>\"\"),Deliverables!L107,\"\")","v":""}]
[{"$f":"IF(Deliverables!B108<>\"\",Deliverables!B108,\"\")","v":""},{"$f":"IF(AND(A113<>\"\",Deliverables!C108<>\"\"),Deliverables!C108,\"\")","v":""},{"$f":"IF(AND(A113<>\"\",Deliverables!D108<>\"\"),Deliverables!D108,\"\")","v":""},{"$f":"IF(AND(A113<>\"\",Deliverables!E108<>\"\"),Deliverables!E108,\"\")","v":""},{"$f":"IF(AND(A113<>\"\",Deliverables!F108<>\"\"),Deliverables!F108,\"\")","v":""},{"$f":"IF(AND(A113<>\"\",Deliverables!G108<>\"\"),Deliverables!G108,\"\")","v":""},{"$f":"IF(AND(A113<>\"\",Deliverables!H108<>\"\"),Deliverables!H108,\"\")","v":""},{"$f":"IF(AND(A113<>\"\",Deliverables!I108<>\"\"),Deliverables!I108,\"\")","v":""},{"$f":"IF(AND(A113<>\"\",Deliverables!J108<>\"\"),Deliverables!J108,\"\")","v":""},{"$f":"IF(AND(A113<>\"\",Deliverables!K108<>\"\"),Deliverables!K108,\"\")","v":""},{"$f":"IF(AND(A113<>\"\",Deliverables!L108<>\"\"),Deliverables!L108,\"\")","v":""}]
[{"$f":"IF(Deliverables!B109<>\"\",Deliverables!B109,\"\")","v":""},{"$f":"IF(AND(A114<>\"\",Deliverables!C109<>\"\"),Deliverables!C109,\"\")","v":""},{"$f":"IF(AND(A114<>\"\",Deliverables!D109<>\"\"),Deliverables!D109,\"\")","v":""},{"$f":"IF(AND(A114<>\"\",Deliverables!E109<>\"\"),Deliverables!E109,\"\")","v":""},{"$f":"IF(AND(A114<>\"\",Deliverables!F109<>\"\"),Deliverables!F109,\"\")","v":""},{"$f":"IF(AND(A114<>\"\",Deliverables!G109<>\"\"),Deliverables!G109,\"\")","v":""},{"$f":"IF(AND(A114<>\"\",Deliverables!H109<>\"\"),Deliverables!H109,\"\")","v":""},{"$f":"IF(AND(A114<>\"\",Deliverables!I109<>\"\"),Deliverables!I109,\"\")","v":""},{"$f":"IF(AND(A114<>\"\",Deliverables!J109<>\"\"),Deliverables!J109,\"\")","v":""},{"$f":"IF(AND(A114<>\"\",Deliverables!K109<>\"\"),Deliverables!K109,\"\")","v":""},{"$f":"IF(AND(A114<>\"\",Deliverables!L109<>\"\"),Deliverables!L109,\"\")","v":""}]
[{"$f":"IF(Deliverables!B110<>\"\",Deliverables!B110,\"\")","v":""},{"$f":"IF(AND(A115<>\"\",Deliverables!C110<>\"\"),Deliverables!C110,\"\")","v":""},{"$f":"IF(AND(A115<>\"\",Deliverables!D110<>\"\"),Deliverables!D110,\"\")","v":""},{"$f":"IF(AND(A115<>\"\",Deliverables!E110<>\"\"),Deliverables!E110,\"\")","v":""},{"$f":"IF(AND(A115<>\"\",Deliverables!F110<>\"\"),Deliverables!F110,\"\")","v":""},{"$f":"IF(AND(A115<>\"\",Deliverables!G110<>\"\"),Deliverables!G110,\"\")","v":""},{"$f":"IF(AND(A115<>\"\",Deliverables!H110<>\"\"),Deliverables!H110,\"\")","v":""},{"$f":"IF(AND(A115<>\"\",Deliverables!I110<>\"\"),Deliverables!I110,\"\")","v":""},{"$f":"IF(AND(A115<>\"\",Deliverables!J110<>\"\"),Deliverables!J110,\"\")","v":""},{"$f":"IF(AND(A115<>\"\",Deliverables!K110<>\"\"),Deliverables!K110,\"\")","v":""},{"$f":"IF(AND(A115<>\"\",Deliverables!L110<>\"\"),Deliverables!L110,\"\")","v":""}]
[{"$f":"IF(Deliverables!B111<>\"\",Deliverables!B111,\"\")","v":""},{"$f":"IF(AND(A116<>\"\",Deliverables!C111<>\"\"),Deliverables!C111,\"\")","v":""},{"$f":"IF(AND(A116<>\"\",Deliverables!D111<>\"\"),Deliverables!D111,\"\")","v":""},{"$f":"IF(AND(A116<>\"\",Deliverables!E111<>\"\"),Deliverables!E111,\"\")","v":""},{"$f":"IF(AND(A116<>\"\",Deliverables!F111<>\"\"),Deliverables!F111,\"\")","v":""},{"$f":"IF(AND(A116<>\"\",Deliverables!G111<>\"\"),Deliverables!G111,\"\")","v":""},{"$f":"IF(AND(A116<>\"\",Deliverables!H111<>\"\"),Deliverables!H111,\"\")","v":""},{"$f":"IF(AND(A116<>\"\",Deliverables!I111<>\"\"),Deliverables!I111,\"\")","v":""},{"$f":"IF(AND(A116<>\"\",Deliverables!J111<>\"\"),Deliverables!J111,\"\")","v":""},{"$f":"IF(AND(A116<>\"\",Deliverables!K111<>\"\"),Deliverables!K111,\"\")","v":""},{"$f":"IF(AND(A116<>\"\",Deliverables!L111<>\"\"),Deliverables!L111,\"\")","v":""}]
[{"$f":"IF(Deliverables!B112<>\"\",Deliverables!B112,\"\")","v":""},{"$f":"IF(AND(A117<>\"\",Deliverables!C112<>\"\"),Deliverables!C112,\"\")","v":""},{"$f":"IF(AND(A117<>\"\",Deliverables!D112<>\"\"),Deliverables!D112,\"\")","v":""},{"$f":"IF(AND(A117<>\"\",Deliverables!E112<>\"\"),Deliverables!E112,\"\")","v":""},{"$f":"IF(AND(A117<>\"\",Deliverables!F112<>\"\"),Deliverables!F112,\"\")","v":""},{"$f":"IF(AND(A117<>\"\",Deliverables!G112<>\"\"),Deliverables!G112,\"\")","v":""},{"$f":"IF(AND(A117<>\"\",Deliverables!H112<>\"\"),Deliverables!H112,\"\")","v":""},{"$f":"IF(AND(A117<>\"\",Deliverables!I112<>\"\"),Deliverables!I112,\"\")","v":""},{"$f":"IF(AND(A117<>\"\",Deliverables!J112<>\"\"),Deliverables!J112,\"\")","v":""},{"$f":"IF(AND(A117<>\"\",Deliverables!K112<>\"\"),Deliverables!K112,\"\")","v":""},{"$f":"IF(AND(A117<>\"\",Deliverables!L112<>\"\"),Deliverables!L112,\"\")","v":""}]
[{"$f":"IF(Deliverables!B113<>\"\",Deliverables!B113,\"\")","v":""},{"$f":"IF(AND(A118<>\"\",Deliverables!C113<>\"\"),Deliverables!C113,\"\")","v":""},{"$f":"IF(AND(A118<>\"\",Deliverables!D113<>\"\"),Deliverables!D113,\"\")","v":""},{"$f":"IF(AND(A118<>\"\",Deliverables!E113<>\"\"),Deliverables!E113,\"\")","v":""},{"$f":"IF(AND(A118<>\"\",Deliverables!F113<>\"\"),Deliverables!F113,\"\")","v":""},{"$f":"IF(AND(A118<>\"\",Deliverables!G113<>\"\"),Deliverables!G113,\"\")","v":""},{"$f":"IF(AND(A118<>\"\",Deliverables!H113<>\"\"),Deliverables!H113,\"\")","v":""},{"$f":"IF(AND(A118<>\"\",Deliverables!I113<>\"\"),Deliverables!I113,\"\")","v":""},{"$f":"IF(AND(A118<>\"\",Deliverables!J113<>\"\"),Deliverables!J113,\"\")","v":""},{"$f":"IF(AND(A118<>\"\",Deliverables!K113<>\"\"),Deliverables!K113,\"\")","v":""},{"$f":"IF(AND(A118<>\"\",Deliverables!L113<>\"\"),Deliverables!L113,\"\")","v":""}]
[{"$f":"IF(Deliverables!B114<>\"\",Deliverables!B114,\"\")","v":""},{"$f":"IF(AND(A119<>\"\",Deliverables!C114<>\"\"),Deliverables!C114,\"\")","v":""},{"$f":"IF(AND(A119<>\"\",Deliverables!D114<>\"\"),Deliverables!D114,\"\")","v":""},{"$f":"IF(AND(A119<>\"\",Deliverables!E114<>\"\"),Deliverables!E114,\"\")","v":""},{"$f":"IF(AND(A119<>\"\",Deliverables!F114<>\"\"),Deliverables!F114,\"\")","v":""},{"$f":"IF(AND(A119<>\"\",Deliverables!G114<>\"\"),Deliverables!G114,\"\")","v":""},{"$f":"IF(AND(A119<>\"\",Deliverables!H114<>\"\"),Deliverables!H114,\"\")","v":""},{"$f":"IF(AND(A119<>\"\",Deliverables!I114<>\"\"),Deliverables!I114,\"\")","v":""},{"$f":"IF(AND(A119<>\"\",Deliverables!J114<>\"\"),Deliverables!J114,\"\")","v":""},{"$f":"IF(AND(A119<>\"\",Deliverables!K114<>\"\"),Deliverables!K114,\"\")","v":""},{"$f":"IF(AND(A119<>\"\",Deliverables!L114<>\"\"),Deliverables!L114,\"\")","v":""}]
[{"$f":"IF(Deliverables!B115<>\"\",Deliverables!B115,\"\")","v":""},{"$f":"IF(AND(A120<>\"\",Deliverables!C115<>\"\"),Deliverables!C115,\"\")","v":""},{"$f":"IF(AND(A120<>\"\",Deliverables!D115<>\"\"),Deliverables!D115,\"\")","v":""},{"$f":"IF(AND(A120<>\"\",Deliverables!E115<>\"\"),Deliverables!E115,\"\")","v":""},{"$f":"IF(AND(A120<>\"\",Deliverables!F115<>\"\"),Deliverables!F115,\"\")","v":""},{"$f":"IF(AND(A120<>\"\",Deliverables!G115<>\"\"),Deliverables!G115,\"\")","v":""},{"$f":"IF(AND(A120<>\"\",Deliverables!H115<>\"\"),Deliverables!H115,\"\")","v":""},{"$f":"IF(AND(A120<>\"\",Deliverables!I115<>\"\"),Deliverables!I115,\"\")","v":""},{"$f":"IF(AND(A120<>\"\",Deliverables!J115<>\"\"),Deliverables!J115,\"\")","v":""},{"$f":"IF(AND(A120<>\"\",Deliverables!K115<>\"\"),Deliverables!K115,\"\")","v":""},{"$f":"IF(AND(A120<>\"\",Deliverables!L115<>\"\"),Deliverables!L115,\"\")","v":""}]
[{"$f":"IF(Deliverables!B116<>\"\",Deliverables!B116,\"\")","v":""},{"$f":"IF(AND(A121<>\"\",Deliverables!C116<>\"\"),Deliverables!C116,\"\")","v":""},{"$f":"IF(AND(A121<>\"\",Deliverables!D116<>\"\"),Deliverables!D116,\"\")","v":""},{"$f":"IF(AND(A121<>\"\",Deliverables!E116<>\"\"),Deliverables!E116,\"\")","v":""},{"$f":"IF(AND(A121<>\"\",Deliverables!F116<>\"\"),Deliverables!F116,\"\")","v":""},{"$f":"IF(AND(A121<>\"\",Deliverables!G116<>\"\"),Deliverables!G116,\"\")","v":""},{"$f":"IF(AND(A121<>\"\",Deliverables!H116<>\"\"),Deliverables!H116,\"\")","v":""},{"$f":"IF(AND(A121<>\"\",Deliverables!I116<>\"\"),Deliverables!I116,\"\")","v":""},{"$f":"IF(AND(A121<>\"\",Deliverables!J116<>\"\"),Deliverables!J116,\"\")","v":""},{"$f":"IF(AND(A121<>\"\",Deliverables!K116<>\"\"),Deliverables!K116,\"\")","v":""},{"$f":"IF(AND(A121<>\"\",Deliverables!L116<>\"\"),Deliverables!L116,\"\")","v":""}]
[null,{"$f":"IF(AND(A122<>\"\",Deliverables!C117<>\"\"),Deliverables!C117,\"\")","v":""},{"$f":"IF(AND(A122<>\"\",Deliverables!D117<>\"\"),Deliverables!D117,\"\")","v":""},{"$f":"IF(AND(A122<>\"\",Deliverables!E117<>\"\"),Deliverables!E117,\"\")","v":""},{"$f":"IF(AND(A122<>\"\",Deliverables!F117<>\"\"),Deliverables!F117,\"\")","v":""},{"$f":"IF(AND(A122<>\"\",Deliverables!G117<>\"\"),Deliverables!G117,\"\")","v":""},{"$f":"IF(AND(A122<>\"\",Deliverables!H117<>\"\"),Deliverables!H117,\"\")","v":""},{"$f":"IF(AND(A122<>\"\",Deliverables!I117<>\"\"),Deliverables!I117,\"\")","v":""},{"$f":"IF(AND(A122<>\"\",Deliverables!J117<>\"\"),Deliverables!J117,\"\")","v":""},{"$f":"IF(AND(A122<>\"\",Deliverables!K117<>\"\"),Deliverables!K117,\"\")","v":""},{"$f":"IF(AND(A122<>\"\",Deliverables!L117<>\"\"),Deliverables!L117,\"\")","v":""}]
["Software Documents",null,"Table 5 of 5"]
["ID","TITLE","ACRONYM",{"$f":"D2","v":"RR"},"PDR","CDR","TRR","QAR","IOCR","DCCR","FR"]
[{"$f":"IF(Deliverables!B118<>\"\",Deliverables!B118,\"\")","v":"S.SW01"},{"$f":"IF(AND(A125<>\"\",Deliverables!C118<>\"\"),Deliverables!C118,\"\")","v":"SW Document #1"},{"$f":"IF(AND(A125<>\"\",Deliverables!D118<>\"\"),Deliverables!D118,\"\")","v":"ACR#11"},{"$f":"IF(AND(A125<>\"\",Deliverables!E118<>\"\"),Deliverables!E118,\"\")","v":"N"},{"$f":"IF(AND(A125<>\"\",Deliverables!F118<>\"\"),Deliverables!F118,\"\")","v":"U"},{"$f":"IF(AND(A125<>\"\",Deliverables!G118<>\"\"),Deliverables!G118,\"\")","v":"U"},{"$f":"IF(AND(A125<>\"\",Deliverables!H118<>\"\"),Deliverables!H118,\"\")","v":"U"},{"$f":"IF(AND(A125<>\"\",Deliverables!I118<>\"\"),Deliverables!I118,\"\")","v":"U"},{"$f":"IF(AND(A125<>\"\",Deliverables!J118<>\"\"),Deliverables!J118,\"\")","v":"U"},{"$f":"IF(AND(A125<>\"\",Deliverables!K118<>\"\"),Deliverables!K118,\"\")","v":"U"},{"$f":"IF(AND(A125<>\"\",Deliverables!L118<>\"\"),Deliverables!L118,\"\")","v":"U"}]
[{"$f":"IF(Deliverables!B119<>\"\",Deliverables!B119,\"\")","v":"S.SW02"},{"$f":"IF(AND(A126<>\"\",Deliverables!C119<>\"\"),Deliverables!C119,\"\")","v":"SW Document #2"},{"$f":"IF(AND(A126<>\"\",Deliverables!D119<>\"\"),Deliverables!D119,\"\")","v":"ACR#12"},{"$f":"IF(AND(A126<>\"\",Deliverables!E119<>\"\"),Deliverables!E119,\"\")","v":""},{"$f":"IF(AND(A126<>\"\",Deliverables!F119<>\"\"),Deliverables!F119,\"\")","v":""},{"$f":"IF(AND(A126<>\"\",Deliverables!G119<>\"\"),Deliverables!G119,\"\")","v":"N"},{"$f":"IF(AND(A126<>\"\",Deliverables!H119<>\"\"),Deliverables!H119,\"\")","v":"U"},{"$f":"IF(AND(A126<>\"\",Deliverables!I119<>\"\"),Deliverables!I119,\"\")","v":"U"},{"$f":"IF(AND(A126<>\"\",Deliverables!J119<>\"\"),Deliverables!J119,\"\")","v":"U"},{"$f":"IF(AND(A126<>\"\",Deliverables!K119<>\"\"),Deliverables!K119,\"\")","v":"C"},{"$f":"IF(AND(A126<>\"\",Deliverables!L119<>\"\"),Deliverables!L119,\"\")","v":"C"}]
[{"$f":"IF(Deliverables!B120<>\"\",Deliverables!B120,\"\")","v":""},{"$f":"IF(AND(A127<>\"\",Deliverables!C120<>\"\"),Deliverables!C120,\"\")","v":""},{"$f":"IF(AND(A127<>\"\",Deliverables!D120<>\"\"),Deliverables!D120,\"\")","v":""},{"$f":"IF(AND(A127<>\"\",Deliverables!E120<>\"\"),Deliverables!E120,\"\")","v":""},{"$f":"IF(AND(A127<>\"\",Deliverables!F120<>\"\"),Deliverables!F120,\"\")","v":""},{"$f":"IF(AND(A127<>\"\",Deliverables!G120<>\"\"),Deliverables!G120,\"\")","v":""},{"$f":"IF(AND(A127<>\"\",Deliverables!H120<>\"\"),Deliverables!H120,\"\")","v":""},{"$f":"IF(AND(A127<>\"\",Deliverables!I120<>\"\"),Deliverables!I120,\"\")","v":""},{"$f":"IF(AND(A127<>\"\",Deliverables!J120<>\"\"),Deliverables!J120,\"\")","v":""},{"$f":"IF(AND(A127<>\"\",Deliverables!K120<>\"\"),Deliverables!K120,\"\")","v":""},{"$f":"IF(AND(A127<>\"\",Deliverables!L120<>\"\"),Deliverables!L120,\"\")","v":""}]
[{"$f":"IF(Deliverables!B121<>\"\",Deliverables!B121,\"\")","v":""},{"$f":"IF(AND(A128<>\"\",Deliverables!C121<>\"\"),Deliverables!C121,\"\")","v":""},{"$f":"IF(AND(A128<>\"\",Deliverables!D121<>\"\"),Deliverables!D121,\"\")","v":""},{"$f":"IF(AND(A128<>\"\",Deliverables!E121<>\"\"),Deliverables!E121,\"\")","v":""},{"$f":"IF(AND(A128<>\"\",Deliverables!F121<>\"\"),Deliverables!F121,\"\")","v":""},{"$f":"IF(AND(A128<>\"\",Deliverables!G121<>\"\"),Deliverables!G121,\"\")","v":""},{"$f":"IF(AND(A128<>\"\",Deliverables!H121<>\"\"),Deliverables!H121,\"\")","v":""},{"$f":"IF(AND(A128<>\"\",Deliverables!I121<>\"\"),Deliverables!I121,\"\")","v":""},{"$f":"IF(AND(A128<>\"\",Deliverables!J121<>\"\"),Deliverables!J121,\"\")","v":""},{"$f":"IF(AND(A128<>\"\",Deliverables!K121<>\"\"),Deliverables!K121,\"\")","v":""},{"$f":"IF(AND(A128<>\"\",Deliverables!L121<>\"\"),Deliverables!L121,\"\")","v":""}]
[{"$f":"IF(Deliverables!B122<>\"\",Deliverables!B122,\"\")","v":""},{"$f":"IF(AND(A129<>\"\",Deliverables!C122<>\"\"),Deliverables!C122,\"\")","v":""},{"$f":"IF(AND(A129<>\"\",Deliverables!D122<>\"\"),Deliverables!D122,\"\")","v":""},{"$f":"IF(AND(A129<>\"\",Deliverables!E122<>\"\"),Deliverables!E122,\"\")","v":""},{"$f":"IF(AND(A129<>\"\",Deliverables!F122<>\"\"),Deliverables!F122,\"\")","v":""},{"$f":"IF(AND(A129<>\"\",Deliverables!G122<>\"\"),Deliverables!G122,\"\")","v":""},{"$f":"IF(AND(A129<>\"\",Deliverables!H122<>\"\"),Deliverables!H122,\"\")","v":""},{"$f":"IF(AND(A129<>\"\",Deliverables!I122<>\"\"),Deliverables!I122,\"\")","v":""},{"$f":"IF(AND(A129<>\"\",Deliverables!J122<>\"\"),Deliverables!J122,\"\")","v":""},{"$f":"IF(AND(A129<>\"\",Deliverables!K122<>\"\"),Deliverables!K122,\"\")","v":""},{"$f":"IF(AND(A129<>\"\",Deliverables!L122<>\"\"),Deliverables!L122,\"\")","v":""}]
[{"$f":"IF(Deliverables!B123<>\"\",Deliverables!B123,\"\")","v":""},{"$f":"IF(AND(A130<>\"\",Deliverables!C123<>\"\"),Deliverables!C123,\"\")","v":""},{"$f":"IF(AND(A130<>\"\",Deliverables!D123<>\"\"),Deliverables!D123,\"\")","v":""},{"$f":"IF(AND(A130<>\"\",Deliverables!E123<>\"\"),Deliverables!E123,\"\")","v":""},{"$f":"IF(AND(A130<>\"\",Deliverables!F123<>\"\"),Deliverables!F123,\"\")","v":""},{"$f":"IF(AND(A130<>\"\",Deliverables!G123<>\"\"),Deliverables!G123,\"\")","v":""},{"$f":"IF(AND(A130<>\"\",Deliverables!H123<>\"\"),Deliverables!H123,\"\")","v":""},{"$f":"IF(AND(A130<>\"\",Deliverables!I123<>\"\"),Deliverables!I123,\"\")","v":""},{"$f":"IF(AND(A130<>\"\",Deliverables!J123<>\"\"),Deliverables!J123,\"\")","v":""},{"$f":"IF(AND(A130<>\"\",Deliverables!K123<>\"\"),Deliverables!K123,\"\")","v":""},{"$f":"IF(AND(A130<>\"\",Deliverables!L123<>\"\"),Deliverables!L123,\"\")","v":""}]
[{"$f":"IF(Deliverables!B124<>\"\",Deliverables!B124,\"\")","v":""},{"$f":"IF(AND(A131<>\"\",Deliverables!C124<>\"\"),Deliverables!C124,\"\")","v":""},{"$f":"IF(AND(A131<>\"\",Deliverables!D124<>\"\"),Deliverables!D124,\"\")","v":""},{"$f":"IF(AND(A131<>\"\",Deliverables!E124<>\"\"),Deliverables!E124,\"\")","v":""},{"$f":"IF(AND(A131<>\"\",Deliverables!F124<>\"\"),Deliverables!F124,\"\")","v":""},{"$f":"IF(AND(A131<>\"\",Deliverables!G124<>\"\"),Deliverables!G124,\"\")","v":""},{"$f":"IF(AND(A131<>\"\",Deliverables!H124<>\"\"),Deliverables!H124,\"\")","v":""},{"$f":"IF(AND(A131<>\"\",Deliverables!I124<>\"\"),Deliverables!I124,\"\")","v":""},{"$f":"IF(AND(A131<>\"\",Deliverables!J124<>\"\"),Deliverables!J124,\"\")","v":""},{"$f":"IF(AND(A131<>\"\",Deliverables!K124<>\"\"),Deliverables!K124,\"\")","v":""},{"$f":"IF(AND(A131<>\"\",Deliverables!L124<>\"\"),Deliverables!L124,\"\")","v":""}]
[{"$f":"IF(Deliverables!B125<>\"\",Deliverables!B125,\"\")","v":""},{"$f":"IF(AND(A132<>\"\",Deliverables!C125<>\"\"),Deliverables!C125,\"\")","v":""},{"$f":"IF(AND(A132<>\"\",Deliverables!D125<>\"\"),Deliverables!D125,\"\")","v":""},{"$f":"IF(AND(A132<>\"\",Deliverables!E125<>\"\"),Deliverables!E125,\"\")","v":""},{"$f":"IF(AND(A132<>\"\",Deliverables!F125<>\"\"),Deliverables!F125,\"\")","v":""},{"$f":"IF(AND(A132<>\"\",Deliverables!G125<>\"\"),Deliverables!G125,\"\")","v":""},{"$f":"IF(AND(A132<>\"\",Deliverables!H125<>\"\"),Deliverables!H125,\"\")","v":""},{"$f":"IF(AND(A132<>\"\",Deliverables!I125<>\"\"),Deliverables!I125,\"\")","v":""},{"$f":"IF(AND(A132<>\"\",Deliverables!J125<>\"\"),Deliverables!J125,\"\")","v":""},{"$f":"IF(AND(A132<>\"\",Deliverables!K125<>\"\"),Deliverables!K125,\"\")","v":""},{"$f":"IF(AND(A132<>\"\",Deliverables!L125<>\"\"),Deliverables!L125,\"\")","v":""}]
[{"$f":"IF(Deliverables!B126<>\"\",Deliverables!B126,\"\")","v":""},{"$f":"IF(AND(A133<>\"\",Deliverables!C126<>\"\"),Deliverables!C126,\"\")","v":""},{"$f":"IF(AND(A133<>\"\",Deliverables!D126<>\"\"),Deliverables!D126,\"\")","v":""},{"$f":"IF(AND(A133<>\"\",Deliverables!E126<>\"\"),Deliverables!E126,\"\")","v":""},{"$f":"IF(AND(A133<>\"\",Deliverables!F126<>\"\"),Deliverables!F126,\"\")","v":""},{"$f":"IF(AND(A133<>\"\",Deliverables!G126<>\"\"),Deliverables!G126,\"\")","v":""},{"$f":"IF(AND(A133<>\"\",Deliverables!H126<>\"\"),Deliverables!H126,\"\")","v":""},{"$f":"IF(AND(A133<>\"\",Deliverables!I126<>\"\"),Deliverables!I126,\"\")","v":""},{"$f":"IF(AND(A133<>\"\",Deliverables!J126<>\"\"),Deliverables!J126,\"\")","v":""},{"$f":"IF(AND(A133<>\"\",Deliverables!K126<>\"\"),Deliverables!K126,\"\")","v":""},{"$f":"IF(AND(A133<>\"\",Deliverables!L126<>\"\"),Deliverables!L126,\"\")","v":""}]
[{"$f":"IF(Deliverables!B127<>\"\",Deliverables!B127,\"\")","v":""},{"$f":"IF(AND(A134<>\"\",Deliverables!C127<>\"\"),Deliverables!C127,\"\")","v":""},{"$f":"IF(AND(A134<>\"\",Deliverables!D127<>\"\"),Deliverables!D127,\"\")","v":""},{"$f":"IF(AND(A134<>\"\",Deliverables!E127<>\"\"),Deliverables!E127,\"\")","v":""},{"$f":"IF(AND(A134<>\"\",Deliverables!F127<>\"\"),Deliverables!F127,\"\")","v":""},{"$f":"IF(AND(A134<>\"\",Deliverables!G127<>\"\"),Deliverables!G127,\"\")","v":""},{"$f":"IF(AND(A134<>\"\",Deliverables!H127<>\"\"),Deliverables!H127,\"\")","v":""},{"$f":"IF(AND(A134<>\"\",Deliverables!I127<>\"\"),Deliverables!I127,\"\")","v":""},{"$f":"IF(AND(A134<>\"\",Deliverables!J127<>\"\"),Deliverables!J127,\"\")","v":""},{"$f":"IF(AND(A134<>\"\",Deliverables!K127<>\"\"),Deliverables!K127,\"\")","v":""},{"$f":"IF(AND(A134<>\"\",Deliverables!L127<>\"\"),Deliverables!L127,\"\")","v":""}]
[{"$f":"IF(Deliverables!B128<>\"\",Deliverables!B128,\"\")","v":""},{"$f":"IF(AND(A135<>\"\",Deliverables!C128<>\"\"),Deliverables!C128,\"\")","v":""},{"$f":"IF(AND(A135<>\"\",Deliverables!D128<>\"\"),Deliverables!D128,\"\")","v":""},{"$f":"IF(AND(A135<>\"\",Deliverables!E128<>\"\"),Deliverables!E128,\"\")","v":""},{"$f":"IF(AND(A135<>\"\",Deliverables!F128<>\"\"),Deliverables!F128,\"\")","v":""},{"$f":"IF(AND(A135<>\"\",Deliverables!G128<>\"\"),Deliverables!G128,\"\")","v":""},{"$f":"IF(AND(A135<>\"\",Deliverables!H128<>\"\"),Deliverables!H128,\"\")","v":""},{"$f":"IF(AND(A135<>\"\",Deliverables!I128<>\"\"),Deliverables!I128,\"\")","v":""},{"$f":"IF(AND(A135<>\"\",Deliverables!J128<>\"\"),Deliverables!J128,\"\")","v":""},{"$f":"IF(AND(A135<>\"\",Deliverables!K128<>\"\"),Deliverables!K128,\"\")","v":""},{"$f":"IF(AND(A135<>\"\",Deliverables!L128<>\"\"),Deliverables!L128,\"\")","v":""}]
[{"$f":"IF(Deliverables!B129<>\"\",Deliverables!B129,\"\")","v":""},{"$f":"IF(AND(A136<>\"\",Deliverables!C129<>\"\"),Deliverables!C129,\"\")","v":""},{"$f":"IF(AND(A136<>\"\",Deliverables!D129<>\"\"),Deliverables!D129,\"\")","v":""},{"$f":"IF(AND(A136<>\"\",Deliverables!E129<>\"\"),Deliverables!E129,\"\")","v":""},{"$f":"IF(AND(A136<>\"\",Deliverables!F129<>\"\"),Deliverables!F129,\"\")","v":""},{"$f":"IF(AND(A136<>\"\",Deliverables!G129<>\"\"),Deliverables!G129,\"\")","v":""},{"$f":"IF(AND(A136<>\"\",Deliverables!H129<>\"\"),Deliverables!H129,\"\")","v":""},{"$f":"IF(AND(A136<>\"\",Deliverables!I129<>\"\"),Deliverables!I129,\"\")","v":""},{"$f":"IF(AND(A136<>\"\",Deliverables!J129<>\"\"),Deliverables!J129,\"\")","v":""},{"$f":"IF(AND(A136<>\"\",Deliverables!K129<>\"\"),Deliverables!K129,\"\")","v":""},{"$f":"IF(AND(A136<>\"\",Deliverables!L129<>\"\"),Deliverables!L129,\"\")","v":""}]
[{"$f":"IF(Deliverables!B130<>\"\",Deliverables!B130,\"\")","v":""},{"$f":"IF(AND(A137<>\"\",Deliverables!C130<>\"\"),Deliverables!C130,\"\")","v":""},{"$f":"IF(AND(A137<>\"\",Deliverables!D130<>\"\"),Deliverables!D130,\"\")","v":""},{"$f":"IF(AND(A137<>\"\",Deliverables!E130<>\"\"),Deliverables!E130,\"\")","v":""},{"$f":"IF(AND(A137<>\"\",Deliverables!F130<>\"\"),Deliverables!F130,\"\")","v":""},{"$f":"IF(AND(A137<>\"\",Deliverables!G130<>\"\"),Deliverables!G130,\"\")","v":""},{"$f":"IF(AND(A137<>\"\",Deliverables!H130<>\"\"),Deliverables!H130,\"\")","v":""},{"$f":"IF(AND(A137<>\"\",Deliverables!I130<>\"\"),Deliverables!I130,\"\")","v":""},{"$f":"IF(AND(A137<>\"\",Deliverables!J130<>\"\"),Deliverables!J130,\"\")","v":""},{"$f":"IF(AND(A137<>\"\",Deliverables!K130<>\"\"),Deliverables!K130,\"\")","v":""},{"$f":"IF(AND(A137<>\"\",Deliverables!L130<>\"\"),Deliverables!L130,\"\")","v":""}]
[{"$f":"IF(Deliverables!B131<>\"\",Deliverables!B131,\"\")","v":""},{"$f":"IF(AND(A138<>\"\",Deliverables!C131<>\"\"),Deliverables!C131,\"\")","v":""},{"$f":"IF(AND(A138<>\"\",Deliverables!D131<>\"\"),Deliverables!D131,\"\")","v":""},{"$f":"IF(AND(A138<>\"\",Deliverables!E131<>\"\"),Deliverables!E131,\"\")","v":""},{"$f":"IF(AND(A138<>\"\",Deliverables!F131<>\"\"),Deliverables!F131,\"\")","v":""},{"$f":"IF(AND(A138<>\"\",Deliverables!G131<>\"\"),Deliverables!G131,\"\")","v":""},{"$f":"IF(AND(A138<>\"\",Deliverables!H131<>\"\"),Deliverables!H131,\"\")","v":""},{"$f":"IF(AND(A138<>\"\",Deliverables!I131<>\"\"),Deliverables!I131,\"\")","v":""},{"$f":"IF(AND(A138<>\"\",Deliverables!J131<>\"\"),Deliverables!J131,\"\")","v":""},{"$f":"IF(AND(A138<>\"\",Deliverables!K131<>\"\"),Deliverables!K131,\"\")","v":""},{"$f":"IF(AND(A138<>\"\",Deliverables!L131<>\"\"),Deliverables!L131,\"\")","v":""}]
[{"$f":"IF(Deliverables!B132<>\"\",Deliverables!B132,\"\")","v":""},{"$f":"IF(AND(A139<>\"\",Deliverables!C132<>\"\"),Deliverables!C132,\"\")","v":""},{"$f":"IF(AND(A139<>\"\",Deliverables!D132<>\"\"),Deliverables!D132,\"\")","v":""},{"$f":"IF(AND(A139<>\"\",Deliverables!E132<>\"\"),Deliverables!E132,\"\")","v":""},{"$f":"IF(AND(A139<>\"\",Deliverables!F132<>\"\"),Deliverables!F132,\"\")","v":""},{"$f":"IF(AND(A139<>\"\",Deliverables!G132<>\"\"),Deliverables!G132,\"\")","v":""},{"$f":"IF(AND(A139<>\"\",Deliverables!H132<>\"\"),Deliverables!H132,\"\")","v":""},{"$f":"IF(AND(A139<>\"\",Deliverables!I132<>\"\"),Deliverables!I132,\"\")","v":""},{"$f":"IF(AND(A139<>\"\",Deliverables!J132<>\"\"),Deliverables!J132,\"\")","v":""},{"$f":"IF(AND(A139<>\"\",Deliverables!K132<>\"\"),Deliverables!K132,\"\")","v":""},{"$f":"IF(AND(A139<>\"\",Deliverables!L132<>\"\"),Deliverables!L132,\"\")","v":""}]
[{"$f":"IF(Deliverables!B133<>\"\",Deliverables!B133,\"\")","v":""},{"$f":"IF(AND(A140<>\"\",Deliverables!C133<>\"\"),Deliverables!C133,\"\")","v":""},{"$f":"IF(AND(A140<>\"\",Deliverables!D133<>\"\"),Deliverables!D133,\"\")","v":""},{"$f":"IF(AND(A140<>\"\",Deliverables!E133<>\"\"),Deliverables!E133,\"\")","v":""},{"$f":"IF(AND(A140<>\"\",Deliverables!F133<>\"\"),Deliverables!F133,\"\")","v":""},{"$f":"IF(AND(A140<>\"\",Deliverables!G133<>\"\"),Deliverables!G133,\"\")","v":""},{"$f":"IF(AND(A140<>\"\",Deliverables!H133<>\"\"),Deliverables!H133,\"\")","v":""},{"$f":"IF(AND(A140<>\"\",Deliverables!I133<>\"\"),Deliverables!I133,\"\")","v":""},{"$f":"IF(AND(A140<>\"\",Deliverables!J133<>\"\"),Deliverables!J133,\"\")","v":""},{"$f":"IF(AND(A140<>\"\",Deliverables!K133<>\"\"),Deliverables!K133,\"\")","v":""},{"$f":"IF(AND(A140<>\"\",Deliverables!L133<>\"\"),Deliverables!L133,\"\")","v":""}]
[{"$f":"IF(Deliverables!B134<>\"\",Deliverables!B134,\"\")","v":""},{"$f":"IF(AND(A141<>\"\",Deliverables!C134<>\"\"),Deliverables!C134,\"\")","v":""},{"$f":"IF(AND(A141<>\"\",Deliverables!D134<>\"\"),Deliverables!D134,\"\")","v":""},{"$f":"IF(AND(A141<>\"\",Deliverables!E134<>\"\"),Deliverables!E134,\"\")","v":""},{"$f":"IF(AND(A141<>\"\",Deliverables!F134<>\"\"),Deliverables!F134,\"\")","v":""},{"$f":"IF(AND(A141<>\"\",Deliverables!G134<>\"\"),Deliverables!G134,\"\")","v":""},{"$f":"IF(AND(A141<>\"\",Deliverables!H134<>\"\"),Deliverables!H134,\"\")","v":""},{"$f":"IF(AND(A141<>\"\",Deliverables!I134<>\"\"),Deliverables!I134,\"\")","v":""},{"$f":"IF(AND(A141<>\"\",Deliverables!J134<>\"\"),Deliverables!J134,\"\")","v":""},{"$f":"IF(AND(A141<>\"\",Deliverables!K134<>\"\"),Deliverables!K134,\"\")","v":""},{"$f":"IF(AND(A141<>\"\",Deliverables!L134<>\"\"),Deliverables!L134,\"\")","v":""}]
[{"$f":"IF(Deliverables!B135<>\"\",Deliverables!B135,\"\")","v":""},{"$f":"IF(AND(A142<>\"\",Deliverables!C135<>\"\"),Deliverables!C135,\"\")","v":""},{"$f":"IF(AND(A142<>\"\",Deliverables!D135<>\"\"),Deliverables!D135,\"\")","v":""},{"$f":"IF(AND(A142<>\"\",Deliverables!E135<>\"\"),Deliverables!E135,\"\")","v":""},{"$f":"IF(AND(A142<>\"\",Deliverables!F135<>\"\"),Deliverables!F135,\"\")","v":""},{"$f":"IF(AND(A142<>\"\",Deliverables!G135<>\"\"),Deliverables!G135,\"\")","v":""},{"$f":"IF(AND(A142<>\"\",Deliverables!H135<>\"\"),Deliverables!H135,\"\")","v":""},{"$f":"IF(AND(A142<>\"\",Deliverables!I135<>\"\"),Deliverables!I135,\"\")","v":""},{"$f":"IF(AND(A142<>\"\",Deliverables!J135<>\"\"),Deliverables!J135,\"\")","v":""},{"$f":"IF(AND(A142<>\"\",Deliverables!K135<>\"\"),Deliverables!K135,\"\")","v":""},{"$f":"IF(AND(A142<>\"\",Deliverables!L135<>\"\"),Deliverables!L135,\"\")","v":""}]
[{"$f":"IF(Deliverables!B136<>\"\",Deliverables!B136,\"\")","v":""},{"$f":"IF(AND(A143<>\"\",Deliverables!C136<>\"\"),Deliverables!C136,\"\")","v":""},{"$f":"IF(AND(A143<>\"\",Deliverables!D136<>\"\"),Deliverables!D136,\"\")","v":""},{"$f":"IF(AND(A143<>\"\",Deliverables!E136<>\"\"),Deliverables!E136,\"\")","v":""},{"$f":"IF(AND(A143<>\"\",Deliverables!F136<>\"\"),Deliverables!F136,\"\")","v":""},{"$f":"IF(AND(A143<>\"\",Deliverables!G136<>\"\"),Deliverables!G136,\"\")","v":""},{"$f":"IF(AND(A143<>\"\",Deliverables!H136<>\"\"),Deliverables!H136,\"\")","v":""},{"$f":"IF(AND(A143<>\"\",Deliverables!I136<>\"\"),Deliverables!I136,\"\")","v":""},{"$f":"IF(AND(A143<>\"\",Deliverables!J136<>\"\"),Deliverables!J136,\"\")","v":""},{"$f":"IF(AND(A143<>\"\",Deliverables!K136<>\"\"),Deliverables!K136,\"\")","v":""},{"$f":"IF(AND(A143<>\"\",Deliverables!L136<>\"\"),Deliverables!L136,\"\")","v":""}]
[{"$f":"IF(Deliverables!B137<>\"\",Deliverables!B137,\"\")","v":""},{"$f":"IF(AND(A144<>\"\",Deliverables!C137<>\"\"),Deliverables!C137,\"\")","v":""},{"$f":"IF(AND(A144<>\"\",Deliverables!D137<>\"\"),Deliverables!D137,\"\")","v":""},{"$f":"IF(AND(A144<>\"\",Deliverables!E137<>\"\"),Deliverables!E137,\"\")","v":""},{"$f":"IF(AND(A144<>\"\",Deliverables!F137<>\"\"),Deliverables!F137,\"\")","v":""},{"$f":"IF(AND(A144<>\"\",Deliverables!G137<>\"\"),Deliverables!G137,\"\")","v":""},{"$f":"IF(AND(A144<>\"\",Deliverables!H137<>\"\"),Deliverables!H137,\"\")","v":""},{"$f":"IF(AND(A144<>\"\",Deliverables!I137<>\"\"),Deliverables!I137,\"\")","v":""},{"$f":"IF(AND(A144<>\"\",Deliverables!J137<>\"\"),Deliverables!J137,\"\")","v":""},{"$f":"IF(AND(A144<>\"\",Deliverables!K137<>\"\"),Deliverables!K137,\"\")","v":""},{"$f":"IF(AND(A144<>\"\",Deliverables!L137<>\"\"),Deliverables!L137,\"\")","v":""}]

{"sheet":"references","index":15,"n_rows":56,"n_cols":3,"rows_kept":56,"cut":false,"hidden":true,"merged":[]}
["ESRIN","ESA – ESRIN Largo Galileo Galilei, 1 00044 FRASCATI, Italy"]
["ESTEC","ESA – ESTEC Keplerlaan 1, 2201 AZ Noordwijk, The Netherlands"]
["ESOC","ESA – ESOC Robert-Bosch Strasse 5, 64293 Darmstadt, Germany"]
["ESAC","ESA – ESAC Camino Bajo del Castillo s/n, 28692 Villafranca del Castillo, Madrid, Espagne"]
["ECSAT","ESA – ECSAT Fermi Avenue Harwell Campus Didcot, Oxfordshire OX11 0FD United Kingdom"]
["EAC","ESA – EAC Linder Hoehe, 51147 Köln, Allemagne"]
["ESA HQ","ESA – ESA HQ Bertrand 24 rue du Général Bertrand CS 30798 75345 Paris CEDEX 7 France"]
[]
[]
[null,"Austria","AT"]
[null,"Belgium","BE"]
[null,"Switzerland","CH"]
[null,"Czech Republic","CZ"]
[null,"Germany","DE"]
[null,"Denmark","DK"]
[null,"Spain","ES"]
[null,"Finland","FI"]
[null,"France","FR"]
[null,"Greece","GR"]
[null,"Hungary","HU"]
[null,"Ireland","IE"]
[null,"Italy","IT"]
[null,"Luxembourg","LU"]
[null,"Netherlands","NL"]
[null,"Norway","NO"]
[null,"Poland","PL"]
[null,"Portugal","PT"]
[null,"Romania","RO"]
[null,"Sweden","SE"]
[null,"United Kingdom","UK"]
[null,"Slovenia","SL"]
[null,"Estonia","EE"]
[]
[]
[]
[]
[]
[]
[null,null,"yes"]
[null,null,"no"]
[]
[]
[]
[]
[]
[]
[null,"Weeks before final delivery",4]
[]
[null,"key personel reference"]
[null,"nego MoM"]
[null,"full proposal"]
[null,"full proposal and nego MoM"]
[]
[]
[null,"Firm Fixed Price"]
[null,"Ceiling Price"]